{"text_format":"1","workbook":"xlsx","n_sheets":29,"sheets":["FIDEVAL","CERT","COB","SOLIC","COTIZADOR (2)","COTIZADOR","FORM","DECLARACIÓN","AUT. CARGO","TABLA AMORT.","COM VEND","PAGARE","RASTREO SATELITAL","AIG- Cotizador Seguro","AIG-Solicitud Cetificado","AIG- Carta Bienvenida (opc)","CHECKLIST VEHICULOS NUEVOS","CHECKLIST VEHICULOS USADOS","CONOZCA A SU CLIENTE PN","HUNTER","AUTOCERTIFICACIÓN PJ","AUTOCERTIFICACIÓN","CONOZCA A SU CLIENTE PN(2)","CONOZCA A SU CLIENTE PJ","CONOZCA A SU CLIENTE PJ(2)","CálculosSeguro","TarifasSeguro","DAT","DESGRAV"],"not_rendered":{"charts":0,"images":28,"macros":0,"external_links":7,"defined_names":183,"comments":0,"pivot_tables":0},"unopened":[],"bounds":{"document_bytes":16777216,"sheet_cells":100000,"rows_first":2000,"rows_last":500,"rows_between":2000,"halvings":0,"cell_chars":16384,"cell_head_chars":4096},"cells_cut":0,"cells_raw":0,"read":"whole","date_system":"1900"}

{"sheet":"FIDEVAL","index":0,"n_rows":17,"n_cols":15,"rows_kept":17,"cut":false,"hidden":false,"merged":[[1,1,1,2],[12,1,12,2]]}
[]
[null,"Cotizador honorarios Fideicomiso de Garantía"]
[]
[null,"Detalle de gastos","Valor",null,null,"Estado Civil cliente","CU","IVA","Q FIRMAS","EJEMPLARES","CVT","IVA TOTAL","BIOMET","COPIAS CERTIFICADAS","TOTAL"]
[null,"# comparecientes","Soltero/a",null,null,"Soltero/a",14.1,2.1149999999999998,2,4,28.2,4.2299999999999995,0.6,{"$f":"(20*1.79)*1.15","v":41.169999999999995},{"$f":"K5+L5+M5+N5","v":74.199999999999989}]
[null,"Notarías *",{"$f":"VLOOKUP(COTIZADOR!F32,F5:O9,10,0)","v":90.714999999999989},null,null,"Viudo/a",14.1,2.1149999999999998,2,4,28.2,4.2299999999999995,0.6,{"$f":"(20*1.79)*1.15","v":41.169999999999995},{"$f":"K6+L6+M6+N6","v":74.199999999999989}]
[null,"Honorarios Fiduciaria (incluye IVA)**",{"$f":"IF(COTIZADOR!F40<=20000,FIDEVAL!C15,IF(AND(COTIZADOR!F40>20000,COTIZADOR!F40<=30000),FIDEVAL!C16,FIDEVAL!C17))","v":436.99999999999994},null,null,"Divorciado/a",14.1,2.1149999999999998,2,4,28.2,4.2299999999999995,0.6,{"$f":"(20*1.79)*1.15","v":41.169999999999995},74.199999999999989]
[null,"Total a cancelar cliente",{"$f":"C6+C7","v":527.71499999999992},null,null,"Casado",14.1,2.1149999999999998,3,4,42.3,6.3449999999999998,0.89999999999999991,{"$f":"(20*1.79)*1.15","v":41.169999999999995},90.714999999999989]
[null,null,null,null,null,"Unión de hecho",14.1,2.1149999999999998,3,4,42.3,6.3449999999999998,0.89999999999999991,{"$f":"(20*1.79)*1.15","v":41.169999999999995},90.714999999999989]
[null,"* El costo varía dependiendo del número de firmas",null,null,null,"Personas jurídicas",14.1,2.1149999999999998,2,4,28.2,4.2299999999999995,0.6,{"$f":"(30*1.79)*1.15","v":61.754999999999995},94.784999999999997]
[null,"** El costo de honorario variable en función al valor del vehículo"]
[]
[null,"HONORARIOS POR ADHESIÓN"]
[null,"VALOR DEL VEHÍCULO","VALOR HONORARIO CON IVA"]
[null,"USD $ 0 - USD $ 20.000,00",{"$f":"300*1.15","v":345}]
[null,"USD $ 20.000,01 - USD $ 30.000,00",{"$f":"330*1.15","v":379.49999999999994}]
[null,"USD $ 30.000,01 - USD $ en adelante",{"$f":"380*1.15","v":436.99999999999994}]

{"sheet":"CERT","index":1,"n_rows":128,"n_cols":9,"rows_kept":128,"cut":false,"hidden":true,"merged":[[1,0,1,8],[3,0,3,2],[3,3,3,5],[3,6,3,8],[5,0,5,1],[5,2,5,5],[6,0,6,1],[6,2,6,5],[6,7,6,8],[7,0,7,1],[7,2,7,5],[7,7,7,8],[8,0,8,1],[8,2,8,5],[8,7,8,8],[10,0,11,8],[13,0,13,1],[13,2,13,5],[13,6,13,7],[14,0,14,1],[14,2,14,5],[14,6,14,7],[15,0,15,1],[15,2,15,5],[15,6,15,7],[16,0,16,1],[16,2,16,5],[16,6,16,7],[17,0,17,1],[17,2,17,5],[17,6,17,7],[18,0,18,1],[18,2,18,5],[18,6,18,7],[19,0,19,1],[19,2,19,5],[19,6,19,7],[20,0,20,1],[20,2,20,5],[20,6,20,7],[21,0,21,1],[21,2,21,5],[21,6,21,7],[22,0,22,1],[22,2,22,5],[22,6,22,7],[24,0,24,7],[25,0,25,5],[26,0,26,5],[27,0,27,5],[28,0,28,5],[29,0,29,5],[30,0,30,5],[31,0,31,5],[32,0,32,5],[33,0,33,5],[34,0,34,5],[37,0,37,7],[38,0,38,5],[40,0,40,5],[41,0,41,5],[60,15,60,17],[42,0,42,5],[43,0,43,5],[44,0,44,5],[45,0,46,8],[47,0,47,8],[54,0,54,3],[54,6,54,8],[61,3,61,8],[65,0,68,8],[69,0,69,8],[127,0,127,8],[55,0,55,1],[56,0,56,8],[57,0,57,8],[58,0,58,8],[60,3,60,8]]}
[]
["CERTIFICADO PROVISIONAL DE SEGURO"]
[]
["VEHÍCULOS",null,null,"PÓLIZA MAESTRA",null,null,"73896 / 71140 / 50393"]
[]
["Contratante:",null,"BANCO DINERS CLUB DEL ECUADOR S.A."]
["Asegurado:",null,{"$f":"FORM!Q38","v":"PRIMER NOMBRE SEGUNDO NOMBRE PRIMER APELLIDO SEGUNDO APELLIDO"},null,null,null,"C.I o R.U.C:",{"$f":"+FORM!$F$40","v":"XXXXXXXXXX"}]
["Dirección:",null,{"$f":"+FORM!$F$46","v":"CARCELEN"},null,null,null,"Teléfono 1:",{"$f":"+FORM!$F$38","v":"CELULAR"}]
["Ciudad:",null,{"$f":"+FORM!$F$48","v":"GUAYAQUIL"},null,null,null,"Teléfono 2:",{"$f":"+FORM!$L$38","v":"CONVENCIONAL"}]
[]
["A.I.G. METROPOLITANA COMPAÑÍA DE SEGUROS Y REASEGUROS S.A. hace constar por este medio que la Póliza de Seguro de Vehículos anteriormente mencionada, asegura a la siguiente propiedad:"]
[]
[]
["Conductor:",null,{"$f":"+DAT!$AG$2","v":"PRIMER APELLIDO SEGUNDO APELLIDO PRIMER NOMBRE SEGUNDO NOMBRE"},null,null,null,"Valor Asegurado US $:",null,{"$f":"+FORM!$F$101","v":10000}]
["Licencia:",null,{"$f":"+DAT!$H$2","v":"XXXXXXXXXX"},null,null,null,"Prima US $:",null,{"$f":"IF(COTIZADOR!$F$46=\"PESADO HASTA 7.5 TN\",COTIZADOR!$X$87,VLOOKUP(COTIZADOR!$F$34,COTIZADOR!$T$88:$AC$90,5,TRUE))","v":29.17}]
["Marca:",null,{"$f":"+FORM!$F$78","v":"HYUNDAI"},null,null,null,"Súper de Bancos:",null,{"$f":"IF(COTIZADOR!$F$46=\"PESADO HASTA 7.5 TN\",COTIZADOR!$Y$87,VLOOKUP(COTIZADOR!$F$34,COTIZADOR!$T$88:$AC$90,6,TRUE))","v":1.02}]
["Modelo:",null,{"$f":"+FORM!$F$80","v":"ACCENT"},null,null,null,"S.S. Campesino",null,{"$f":"IF(COTIZADOR!$F$46=\"PESADO HASTA 7.5 TN\",COTIZADOR!$Z$87,VLOOKUP(COTIZADOR!$F$34,COTIZADOR!$T$88:$AC$90,7,TRUE))","v":0.14585000000000001}]
["Tipo:",null,{"$f":"+FORM!$F$85","v":"SEDAN"},null,null,null,"I.V.A.:",null,{"$f":"IF(COTIZADOR!$F$46=\"PESADO HASTA 7.5 TN\",COTIZADOR!$AA$87,VLOOKUP(COTIZADOR!$F$34,COTIZADOR!$T$88:$AC$90,8,TRUE))","v":3.6403020000000001}]
["Año:",null,{"$f":"+FORM!$F$87","v":"2022"},null,null,null,"D / Emisión US $:",null,{"$f":"IF(COTIZADOR!$F$46=\"PESADO HASTA 7.5 TN\",COTIZADOR!$AB$87,VLOOKUP(COTIZADOR!$F$34,COTIZADOR!$T$88:$AC$90,9,TRUE))","v":0.04}]
["Color:",null,{"$f":"+FORM!$F$89","v":"ROJO"},null,null,null,"Prima Total:",null,{"$f":"IF(COTIZADOR!$F$46=\"PESADO HASTA 7.5 TN\",COTIZADOR!$AC$87,VLOOKUP(COTIZADOR!$F$34,COTIZADOR!$T$88:$AC$90,10,TRUE))","v":34.016151999999998}]
["Placa:",null,"S / P",null,null,null,"Fecha Inicio:",null,{"$f":"+FORM!$F$9","v":"2025-02-07"}]
["Número Motor:",null,{"$f":"+FORM!$F$91","v":"BU456792826RE7"},null,null,null,"Fecha de Aniversario:",null,{"$f":"+SOLIC!$C$44","v":"2027-02-09"}]
["Número Chasis:",null,{"$f":"+FORM!$F$93","v":"CG5342892U"},null,null,null,"Vigencia del Certificado:",null,"MENSUAL"]
[]
["AMPAROS BÁSICOS",null,null,null,null,null,null,null,"LIMITES"]
["1. Responsabilidad Civil Extracontractual",null,null,null,null,null,null,null,{"$f":"IF(FORM!$F$101>=25000,30000,IF(FORM!$F$101<25000,\"           \"))","v":"           "}]
["   1.1. Lesiones Corporales",null,null,null,null,null,null,null,{"$f":"IF(FORM!$F$101>=25000,\"         \",IF(FORM!$F$101<25000,15000))","v":15000}]
["   1.2. Daños a la Propiedad Ajena",null,null,null,null,null,null,null,{"$f":"IF(FORM!$F$101>=25000,\"         \",IF(FORM!$F$101<25000,15000))","v":15000}]
["2. Perdida Total del Vehículo por Daños",null,null,null,null,null,null,null,{"$f":"+I14","v":10000}]
["3. Pérdida Parcial del Vehículo por Daños",null,null,null,null,null,null,null,{"$f":"+I14","v":10000}]
["4. Pérdida Total del vehículo por Robo",null,null,null,null,null,null,null,{"$f":"+I14","v":10000}]
["5. Pérdida Parcial del vehículo por Robo",null,null,null,null,null,null,null,{"$f":"+I14","v":10000}]
["6. Lesiones a Ocupantes del vehículo"]
["    6.1. Gastos Médicos por ocupante",null,null,null,null,null,null,null,{"$f":"IF(FORM!$F$101>=25000,3000,IF(FORM!$F$101<25000,2000))","v":2000}]
["    6.2. Accidentes Personales por ocupante",null,null,null,null,null,null,null,{"$f":"IF(FORM!$F$101>=25000,5000,IF(FORM!$F$101<25000,4000))","v":4000}]
["7. Gastos de Grúa, Transporte y Protección del vehículos",null,null,null,null,null,null,null,200]
[]
["AMPAROS ADICIONALES",null,null,null,null,null,null,null,"LIMITES"]
["Perdida o robo de la llave del vehiculo máximo 1 evento al año",null,null,null,null,null,null,null,150]
["Perdida o robo de documentos (Soat, Licencia, Matricula, Cédula de identidad) 1 evento al año",null,null,null,null,null,null,null,100]
["Gastos de Transporte para el Asegurado / US$ 10,oo diarios",null,null,null,null,null,null,null,600]
["Amparo jurídico en proceso penal",null,null,null,null,null,null,null,1000]
["Cobertura para Conductores menores de 25 años",null,null,null,null,null,null,null,{"$f":"+I14","v":10000}]
["Deducible: "]
["10% del valor del siniestro, mínimo 1% del valor asegurado, no inferior a US$",null,null,null,null,null,{"$f":"IF(I14>=25000,350,200)","v":200},"por evento"]
["EL PRESENTE CERTIFICADO TIENE VIGENCIA MENSUAL Y PERMANECERÁ VIGENTE MIENTRAS EL CREDITO DEL CLIENTE CON DINERS CLUB ESTE CON VIGENCIA"]
[]
[]
[]
[]
[]
[]
[]
[]
["EL ASEGURADO",null,null,null,null,null,"LA COMPAÑÍA"]
["FECHA DE EMISIÓN:",null,{"$f":"+SOLIC!A44","v":"2025-02-07"}]
["Quito: Av. Brasil 293 y Antonio Granda Centeno 5to piso Telef. (593-2) 395-5000 / 1800-AIG-AIG / fax: 2924-424\nGuayaquil: Av. Rodrigo Chávez Gonzalez. Parque empresarial Colón, Edf. Corporativo II, 2do piso of. 203 - Telf. (593-4) 390-4177 / 390-4179 / 390-4180\nCuenca: Av. Ordoñez Lazo 5-42 y Laureles (Frente a Produbanco) - PBX: (593-7) 407-5814 / 407-5818"]
[]
[]
[]
[]
[]
[]
[]
[]
["En caso que necesite información adicional puede comunicarse con nuestras oficinas, nos será muy grato el poderle atender o directamente a: Banco Diners Club del Ecuador S.A."]
[]
[]
[]
["CONDICIONES GENERALES"]
[]
[]
[]
[]
[]
[]
[]
[]
[]
[]
[]
[]
[]
[]
[]
[]
[]
[]
[]
[]
[]
[]
[]
[]
[]
[]
[]
[]
[]
[]
[]
[]
[]
[]
[]
[]
[]
[]
[]
[]
[]
[]
[]
[]
[]
[]
[]
[]
[]
[]
[]
[]
[]
[]
[]
[]
[]
["El presente certificado es un resumen de las Condiciones Generales de la Póliza, en caso de existir una diferencia entre el presente certificado y las Condiciones Generales, regirán las existentes en la Póliza"]

{"sheet":"COB","index":2,"n_rows":34,"n_cols":3,"rows_kept":34,"cut":false,"hidden":true,"merged":[[5,0,5,1],[5,2,5,4],[12,0,12,5],[18,0,18,5],[19,0,19,5],[20,0,20,5],[34,0,34,5],[35,0,35,5],[35,6,35,8],[22,0,22,5],[24,0,24,1],[29,0,29,5],[30,0,30,5],[32,0,32,5],[33,0,33,5]]}
[]
[]
[]
[]
[]
[{"$f":"FORM!F26","v":"GUAYAQUIL"},null,{"$f":"+CERT!C56","v":"2025-02-07"}]
[]
["Señor (a).-",{"$f":"FORM!Q38","v":"PRIMER NOMBRE SEGUNDO NOMBRE PRIMER APELLIDO SEGUNDO APELLIDO"}]
[]
["Presente."]
[]
[]
["GRACIAS POR DEPOSITAR SU CONFIANZA EN NOSOTROS!"]
[]
[]
["Estimado Cliente"]
[]
[]
["Porque sabemos lo importante que es para usted su seguridad,  AIG Metropolitana se complace en entregarle su certificado provisional de seguro, el mismo que le servirá como respaldo en una eventualidad.\n\nDesde este momento usted se encuentra respaldado con la protección que AIG Metropolitana ha diseñado exclusivamente para usted, las 24 horas del día, los 365 días del año dentro del Pacto Andino, la cobertura que usted tiene ampara a su vehículo tanto por robo total, robo parcial, choque o pérdida total por choque además de lesiones a los ocupantes de su vehículo. \n\nEn caso de accidente o daño de su vehículo por favor comuníquese a nuestra central de reclamos 2-990-711, estaremos gustosos de poder servirle y solventar cualquier inquietud.\n\nSi el valor del vehículo es igual o mayor a US$ 20.000, se deberá mantener instalado y en funcionamiento el dispositivo de seguridad requerido, para contar con la cobertura de PERDIDA TOTAL POR ROBO."]
["Las coberturas de su seguro tiene validez durante el período de vigencia del crédito contratado y será extendido automáticamente de manera indefinida hasta que usted manifieste su voluntad de no seguir con el mismo o no esté al día en sus pagos."]
["Confiamos que la tranquilidad y el respaldo que este seguro brindará a su familia y a su patrimonio, será de su completo agrado."]
[]
["Una vez más agradecemos su preferencia y lo invitamos a seguir disfrutando de sus beneficios como cliente de AIG Metropolitana; oportunamente le haremos llegar el certificado de seguro definitivo."]
[]
["ATENTAMENTE"]
[]
[]
[]
[]
["FRANKLIN VALDIVIESO"]
["GERENTE DE VEHICULOS"]
[]
[]
["Quito: Av. Brasil 293 y Antonio Granda Centeno 5to piso Telef. (593-2) 395-5000 / 1800-AIG-AIG / fax: 2924-424\nGuayaquil: Av. Rodrigo Chávez Gonzalez. Parque empresarial Colón, Edf. Corporativo II, 2do piso of. 203 - Telf. (593-4) 390-4177 / 390-4179 / 390-4180\nCuenca: Av. Ordoñez Lazo 5-42 y Laureles (Frente a Produbanco) - PBX: (593-7) 407-5814 / 407-5818"]

{"sheet":"SOLIC","index":3,"n_rows":82,"n_cols":17,"rows_kept":82,"cut":false,"hidden":true,"merged":[[2,10,2,11],[4,10,4,11],[8,0,8,14],[10,1,10,8],[10,12,10,14],[12,1,12,8],[12,12,12,14],[14,1,14,8],[14,12,14,14],[16,1,16,8],[16,12,16,14],[18,1,18,8],[18,12,18,14],[20,0,20,14],[22,0,23,0],[22,1,23,3],[22,4,23,7],[22,8,23,8],[22,9,23,10],[22,11,23,12],[22,13,23,14],[24,1,24,3],[24,4,24,7],[24,9,24,10],[24,11,24,12],[24,13,24,14],[25,1,25,3],[25,4,25,7],[25,9,25,10],[25,11,25,12],[25,13,25,14],[26,1,26,3],[26,4,26,7],[26,9,26,10],[26,11,26,12],[26,13,26,14],[27,1,27,3],[27,4,27,7],[27,9,27,10],[27,11,27,12],[27,13,27,14],[28,1,28,3],[28,4,28,7],[28,9,28,10],[28,11,28,12],[28,13,28,14],[30,0,30,4],[30,6,30,8],[30,10,30,14],[32,1,32,4],[32,12,32,14],[34,1,34,4],[34,12,34,14],[36,1,36,4],[36,12,36,14],[39,0,39,4],[39,6,39,14],[41,2,41,4],[41,8,41,10],[41,13,41,14],[43,2,43,4],[43,8,43,10],[43,13,43,14],[49,6,51,8],[45,2,45,4],[45,8,45,10],[45,13,45,14],[47,2,47,4],[47,8,47,10],[47,13,47,14],[49,0,49,4],[49,12,49,14],[50,0,50,3],[51,12,51,14],[53,12,53,14],[60,0,60,14],[61,0,61,14],[62,0,62,14],[63,0,63,14],[55,6,55,8],[55,10,55,14],[56,6,56,8],[56,10,56,14],[59,0,59,14],[64,0,64,14],[65,0,65,14],[66,0,66,14],[69,6,69,8],[70,6,70,8],[72,0,72,3],[72,5,72,9],[74,0,74,3],[74,5,74,9],[83,0,83,14],[74,11,74,14],[75,11,75,14],[77,0,78,14],[80,0,80,14],[81,0,81,14],[82,0,82,14]]}
[]
[]
[]
[]
[null,null,null,null,null,null,null,null,null,null,"POLIZA MAESTRA:",null,{"$f":"+CERT!G4","v":"73896 / 71140 / 50393"}]
[]
[]
[]
["SOLICITUD DE SEGURO DE VEHÍCULOS FINANCIADOS"]
[]
["ASEGURADO:",{"$f":"FORM!Q38","v":"PRIMER NOMBRE SEGUNDO NOMBRE PRIMER APELLIDO SEGUNDO APELLIDO"},null,null,null,null,null,null,null,null,"C.I / R.U.C.:",null,{"$f":"FORM!$F$40","v":"XXXXXXXXXX"}]
[]
["DIRECCIÓN:",{"$f":"FORM!$F$46","v":"CARCELEN"},null,null,null,null,null,null,null,null,"TELÉFONO:",null,{"$f":"+FORM!$F$38","v":"CELULAR"}]
[]
["CIUDAD:",{"$f":"FORM!$F$48","v":"GUAYAQUIL"},null,null,null,null,null,null,null,null,"TELFONO ADICIONAL:",null,{"$f":"+FORM!$L$38","v":"CONVENCIONAL"}]
[]
["TIPO LICENCIA:",null,null,null,null,null,null,null,null,null,"FAX:"]
[]
["No. LICENCIA:",{"$f":"+FORM!$F$40","v":"XXXXXXXXXX"},null,null,null,null,null,null,null,null,"CADUCA. LIC.:"]
[]
["DATOS DEL USUARIO (INCLUIR SOLICITANTE Y CUALQUIER DEPENDIENTE MAYOR DE 18 AÑOS DE EDAD)"]
[]
["NOMBRE","FECHA NACMTO",null,null,"SEXO (M/F)",null,null,null,"ESTADO CIVIL","PARENTESCO",null,"AÑOS VIGENCIA LICENCIA",null,"% DE USO"]
[]
[{"$f":"IF(FORM!C123=0,\" \",FORM!C123)","v":" "},{"$f":"IF(FORM!F123=0,\" \",FORM!F123)","v":" "},null,null,{"$f":"IF(FORM!I123=0,\" \",FORM!I123)","v":" "},null,null,null,{"$f":"IF(FORM!L123=0,\" \",FORM!L123)","v":" "},null,null,null,null,{"$f":"IF(FORM!O123=0,\" \",FORM!O123)","v":" "}]
[{"$f":"IF(FORM!C124=0,\" \",FORM!C124)","v":" "},{"$f":"IF(FORM!F124=0,\" \",FORM!F124)","v":" "},null,null,{"$f":"IF(FORM!I124=0,\" \",FORM!I124)","v":" "},null,null,null,{"$f":"IF(FORM!L124=0,\" \",FORM!L124)","v":" "},null,null,null,null,{"$f":"IF(FORM!O124=0,\" \",FORM!O124)","v":" "}]
[{"$f":"IF(FORM!C125=0,\" \",FORM!C125)","v":" "},{"$f":"IF(FORM!F125=0,\" \",FORM!F125)","v":" "},null,null,{"$f":"IF(FORM!I125=0,\" \",FORM!I125)","v":" "},null,null,null,{"$f":"IF(FORM!L125=0,\" \",FORM!L125)","v":" "},null,null,null,null,{"$f":"IF(FORM!O125=0,\" \",FORM!O125)","v":" "}]
[{"$f":"IF(FORM!C126=0,\" \",FORM!C126)","v":" "},{"$f":"IF(FORM!F126=0,\" \",FORM!F126)","v":" "},null,null,{"$f":"IF(FORM!I126=0,\" \",FORM!I126)","v":" "},null,null,null,{"$f":"IF(FORM!L126=0,\" \",FORM!L126)","v":" "},null,null,null,null,{"$f":"IF(FORM!O126=0,\" \",FORM!O126)","v":" "}]
[{"$f":"IF(FORM!C127=0,\" \",FORM!C127)","v":" "},{"$f":"IF(FORM!F127=0,\" \",FORM!F127)","v":" "},null,null,{"$f":"IF(FORM!I127=0,\" \",FORM!I127)","v":" "},null,null,null,{"$f":"IF(FORM!L127=0,\" \",FORM!L127)","v":" "},null,null,null,null,{"$f":"IF(FORM!O127=0,\" \",FORM!O127)","v":" "}]
[]
["LUGAR DE TRAB. DEL USUARIO PRINCIPAL",null,null,null,null,null,"USO PRINCIPAL DEL VEHIC.",null,null,null,"KILOMETRAJE VEHÍCULO"]
[]
["LUGAR TRABAJO:",{"$f":"FORM!$F$52","v":"QUITO"},null,null,null,null,"OF / TRAB:",null,null,null,"KM. IDA Y VUELTA:"]
[]
["CARGO:",{"$f":"+FORM!$F$58","v":"INGENIERO"},null,null,null,null,"PLACER:",null,null,null,"KM. ANUAL:"]
[]
["TIEMPO FCTO (AÑOS):",{"$f":"+FORM!$F$105/12","v":2},null,null,null,null,"OTRO:",null,null,null,"KM. ANUAL:"]
[]
[]
["VIGENCIA",null,null,null,null,null,"DESCRIPCIÓN DEL VEHÍCULO"]
[]
["DESDE",null,"HASTA",null,null,null,"MARCA:",null,{"$f":"+CONCATENATE(FORM!$F$78,\"-\",FORM!$F$80,\"-\",FORM!$F$85)","v":"HYUNDAI-ACCENT-SEDAN"},null,null,null,"VALOR:",{"$f":"FORM!$F$101","v":10000}]
[]
[{"$f":"+FORM!F9","v":"2025-02-07"},null,{"$f":"IF(FORM!F105/12=1,'TABLA AMORT.'!B32)+IF(FORM!F105/12=2,'TABLA AMORT.'!B44)+IF(FORM!F105/12=3,'TABLA AMORT.'!B56)+IF(FORM!F105/12=4,'TABLA AMORT.'!B68)+IF(FORM!F105/12=5,'TABLA AMORT.'!B80)","v":"2027-02-09"},null,null,null,"AÑO FAB.:",null,{"$f":"FORM!$F$87","v":"2022"},null,null,null,"TASA:",{"$f":"IF(COTIZADOR!$F$46=\"PESADO HASTA 7.5 TN\",COTIZADOR!$V$87,VLOOKUP(COTIZADOR!$F$34,COTIZADOR!$T$88:$AC$90,3,TRUE))%","v":3.5000000000000003E-2}]
[]
["USO / DESTINO:",null,null,null,null,null,"# MOTOR:",null,{"$f":"FORM!$F$91","v":"BU456792826RE7"},null,null,null,"COLOR:",{"$f":"FORM!$F$89","v":"ROJO"}]
[]
["SEGURIDADES:",null,null,null,null,null,"# CHASIS:",null,{"$f":"FORM!$F$93","v":"CG5342892U"},null,null,null,"Prima Mensual",{"$f":"+CERT!I20","v":34.016151999999998}]
[]
["BENEFICIARIO ACREEDOR A FAVOR DE:",null,null,null,null,null,"BANCO DINERS CLUB DEL ECUADOR S.A.",null,null,null,"CONCESIONARIO:",null,{"$f":"FORM!$F$14","v":"CONCESIONARIO"}]
[]
[null,null,null,null,null,null,null,null,null,null,"VENDEDOR",null,{"$f":"COTIZADOR!F14","v":"NOMBRE Y APELLIDO"}]
[]
[null,null,null,null,null,null,null,null,null,null,"CI. VENDEDOR",null,{"$f":"FORM!F30","v":"XXXXXXXXXX"}]
[]
[null,null,null,null,null,null,"NUMERO DE TARJETA:",null,null,null,{"$f":"FORM!F147","v":"XXXXXXXXXX1234"}]
[null,null,null,null,null,null,"FECHA DE EXPIRACIÓN",null,null,null,{"$f":"+FORM!F153","v":"2023-07-01"}]
[]
[]
["Declaro Conocer y Aceptar que El Seguro del Vehículo  Permanece Vigente durante el Tiempo de Crédito y que el vehículo aquí detallado y asegurado sea endosado a favor de Banco Diners Club S.A. mientras esté vigente el crédito."]
["Todo vehículo tipo camioneta y todo vehículo cuyo valor sea igual o superior a  US $20.000,00,  deberá mantener instalado y en funcionamiento el dispositivo de seguridad, para contar con la cobertura de robo total."]
["Adicionalmente La Compañía de Seguros acepta los vehículos que vengan instalados de fábrica,los dispositivos Chevystar Silver,Gold o Platinum y Maresa Satelital."]
["Autorizo a AIG Metropolitana  Renovar Automaticamente el Seguro de mi Vehículo cuando Finalice el Crédito.",null,null,null,null,null,null,null,null,null,null,null,null,null,null,null,"  "]
[]
[" Debo  y pagaré  incondicionalmente y sin protesto al Emisor el total de esta Orden de Cargo más los intereses impuestos legales así como los intereses y cargos por servicio, en el lugar y fecha que se convenga ."]
[" En caso  de mora pagaré la tasa máxima autorizada por el Emisor. Desde ya renuncio a cualquier reclamación y a iniciar cualquier acción legal en contral del emisor, el mismo que no requerirá de otro instrumento o documento para procesar en mi tarjeta de crédito, los valores generados, los mismos que desde ya los acepto y reconozco como obligación."]
["De igual manera autorizo que en caso de pérdida, hurto, robo o cualquier circunstancia por el que fuera cambiado el número de la tarjeta de crédito antes singularizada, se cuenta con el nuevo número que se me asigne para efectuar todos los pagos de manera incondicional dentro del período correspondiente, de tal manera que el cambio del número indicado no sea causa para no cancelar los valores que adeude."]
[]
[]
[]
[null,null,null,null,null,null,"FIRMA"]
[]
["FECHA",null,null,null,null,"CIUDAD"]
[]
[{"$f":"+FORM!F9","v":"2025-02-07"},null,null,null,null,{"$f":"+FORM!F26","v":"GUAYAQUIL"}]
[]
[null,null,null,null,null,null,null,null,null,null,null,null,null,null,null," "]
[]
[]
[]
["ESTA SOLICITUD ES PARTE INTEGRANTE DE LA PÓLIZA"]
["Quito: Av. Brasil 293 y Antonio Granda Centeno 5to piso Telef. (593-2) 395-5000 / 1800-AIG-AIG / fax: 2924-424\nGuayaquil: Av. Rodrigo Chávez Gonzalez. Parque empresarial Colón, Edf. Corporativo II, 2do piso of. 203 - Telf. (593-4) 390-4177 / 390-4179 / 390-4180\nCuenca: Av. Ordoñez Lazo 5-42 y Laureles (Frente a Produbanco) - PBX: (593-7) 407-5814 / 407-5818"]

{"sheet":"COTIZADOR (2)","index":4,"n_rows":689,"n_cols":81,"rows_kept":689,"cut":false,"hidden":true,"merged":[[163,2,163,3],[170,2,170,3],[88,74,88,80],[89,74,89,80],[90,74,90,80],[91,74,91,80],[92,74,92,80],[158,2,158,3],[87,74,87,80],[64,2,64,3],[64,5,64,14],[66,2,66,3],[66,5,66,14],[68,2,68,14],[70,2,70,3],[70,5,70,8],[70,11,70,14],[72,2,72,3],[72,5,72,8],[84,2,84,3],[85,2,85,3],[86,74,86,80],[58,2,58,3],[58,5,58,14],[60,2,60,3],[60,5,60,14],[62,2,62,3],[62,5,62,14],[52,2,52,3],[52,5,52,14],[54,2,54,3],[54,5,54,14],[56,2,56,3],[56,5,56,14],[45,2,45,3],[45,5,45,14],[47,2,47,3],[47,5,47,14],[50,2,50,3],[50,5,50,14],[39,2,39,3],[39,5,39,14],[41,2,41,3],[41,5,41,14],[43,2,43,3],[43,5,43,14],[33,2,33,3],[33,5,33,14],[35,2,35,3],[35,5,35,14],[37,2,37,3],[37,5,37,14],[27,2,27,3],[27,5,27,14],[29,2,29,3],[29,5,29,14],[31,2,31,3],[31,5,31,14],[21,2,21,3],[21,5,21,8],[21,11,21,14],[23,2,23,14],[25,2,25,3],[25,5,25,14],[15,2,15,14],[17,2,17,3],[17,5,17,8],[17,11,17,14],[19,2,19,3],[19,5,19,8],[19,11,19,14],[2,3,2,13],[4,3,4,13],[7,2,7,14],[9,2,9,3],[13,2,13,3],[13,5,13,14]]}
[]
[]
[null,null,null,"FINANCIAMIENTO VEHICULAR"]
[]
[null,null,null,"COTIZADOR"]
[]
[]
[null,null,null,null,null,null,null,null,null,null,null,null,null,null,null,null,null,null,null,null,null,null,null,null,null,null,null,null,null,null,null,null,null,null,null,null,null,null,null,null,null," "]
[]
[null,null,"FECHA DE COTIZACION",null,null,{"$f":"TODAY()","v":"2025-02-07"},null,"AAAA/MM/DD"]
[]
[]
[]
[null,null,"NOMBRES Y APELLIDOS DEL VENDEDOR:",null,null,"DENISSE SIERRA"]
[]
[null,null,"DATOS INFORMATIVOS DEL CLIENTE"]
[]
[null,null,"APELLIDOS:",null,null,"ANDRADE",null,null,null,null,null,"VARGAS"]
[]
[null,null,"NOMBRES:",null,null,"HANS",null,null,null,null,null,"FABIAN",null,null,null,null,{"$f":"CONCATENATE(F20,\" \",L20)","v":"HANS FABIAN"}]
[]
[null,null,"TELEFONOS:",null,null,"0979060369",null,null,null,null,null,"2899532"]
[]
[null,null,"DATOS DEL VEHICULO"]
[]
[null,null,"MARCA",null,null,"MAZDA"]
[]
[null,null,"MODELO:",null,null,"CX3"]
[]
[null,null,"AÑO:",null,null,2019]
[]
[null,null,"ESTADO CIVIL:",null,null,"Soltero/a"]
[]
[null,null,"VALOR DE FINANCIAMIENTO DEL VEHICULO (INCLUIDO IVA):",null,null,20000,null,null,null,null,null,null,null,null,null,null,"Se ingresa",null,null,null,null,null,null,null,null,null,null,null,null,null,null,null,null,null,null,null,null,null,null,null,null,null,null,null,null,null,null,null,null,null,null,null,null,null,null,null,null,null,null,null,null,null,null,null,null,null,null,null,null,null,null,null,null,null,null,null,null,"A",25000,"S",30000]
[null,null,null,null,null,null,null,null,null,null,null,null,null,null,null,null,null,null,null,{"$f":"+F40/F34","v":0},null,null,null,null,null,null,null,null,null,null,null,null,null,null,null,null,null,null,null,null,null,null,null,null,null,null,null,null,null,null,null,null,null,null,null,null,null,null,null,null,null,null,null,null,null,null,null,null,null,null,null,null,null,null,null,null,null,null,null,"S"]
[null,null,"VALIDACION % DE ENTRADA:",null,null,{"$f":"IF(F40/F34>=25%,F40/F34,\"ENTRADA MENOR AL 25%\")","v":"ENTRADA MENOR AL 25%"},null,null,null,null,null,null,null,null,null,null,"Calculado, no uede ser inferior al 25%",null,null,null,null,null,null,null,null,null,null,null,null,null,null,null,null,null,null,null,null,null,null,null,null,null,null,null,null,null,null,null,null,null,null,null,null,null,null,null,null,null,null,null,null,null,null,null,null,null,null,null,null,null,null,null,null,null,null,null,null,null,35000,"C",{"$f":"+CC34*25%","v":7500}]
[]
[null,null,"VALOR MINIMO DE ENTRADA:",null,null,null,null,null,null,null,null,null,null,null,null,null,"Se ingresa",null,null,null,null,null,null,null,null,null,null,null,null,null,null,null,null,null,null,null,null,null,null,null,null,null,null,null,null,null,null,null,null,null,null,null,null,null,null,null,null,null,null,null,null,null,null,null,null,null,null,null,null,null,null,null,null,null,null,null,null,null,null,null,{"$f":"+CA36-CC36","v":27500}]
[]
[null,null,"VALOR DE ENTRADA DEL CLIENTE:"]
[]
[null,null,"PLAZO MESES FINANCIAMIENTO:",null,null,12,null,null,null,null,null,null,null,null,null,null,"Ingresa en meses o años"]
[]
[null,null,"TIPO DE CLIENTE:",null,null,"PERSONAL",null,null,null,null,null,null,null,null,null,null,"Selecciona"]
[]
[null,null,"TIPO DEL VEHICULO:",null,null,"LIVIANO",null,null,null,null,null,null,null,null,null,null,"Selecciona"]
[]
[null,null,"TASA MAXIMA DE INTERES VIGENTE DINERS:",null,null,{"$f":"VLOOKUP(F44,AQ87:AR90,2,FALSE)","v":0.156},null,null,null,null,null,null,null,null,null,null,"Recupera del parametro"]
[]
[]
[null,null,"DISPOSITIVO:",null,null,"Sin Dispositivo",null,null,null,null,null,null,null,null,null,null,"No se muestra, para efectos del simulador aplicar un valor promedio de 40 USD"]
[]
[null,null,"PLAZO GASTOS LEGALES:",null,null,"CORRIENTE",null,null,null,null,null,null,null,null,null,null,"Seleccion"]
[]
[null,null,"CUOTA MENSUAL SEGURO VEHICULAR PRIMER AÑO:",null,null,{"$f":"'AIG- Cotizador Seguro'!$I$6","v":125.58383333333335},null,null,null,null,null,null,null,null,null,null,"Calculo"]
[]
[null,null,"CUOTA GASTOS LEGALES:",null,null,{"$f":"IF($F$53=\"3 MESES SIN INTERESES\",FORM!$F$133/3,FORM!$F$133)","v":527.71499999999992},null,null,null,null,null,null,null,null,null,null,"Calculo"]
[]
[null,null,"CUOTA MENSUAL RASTREO SATELITAL:",null,null,{"$f":"+FORM!F139","v":0},null,null,null,null,null,null,null,null,null,null,"Calculo"]
[]
[null,null,"CUOTA MENSUAL SEGURO DESGRAVAMEN",null,null,"0,099% MENSUAL SOBRE EL SALDO DE LA TARJETA DE CREDITO"]
[]
[null,null,"CUOTA MENSUAL VEHICULO:",null,null,{"$f":"+FORM!F143","v":488.72375364369611},null,null,null,null,null,null,null,null,null,null,"Calculo"]
[]
[null,null,"VALOR A PAGAR MENSUALMENTE SIN G. LEGALES:",null,null,{"$f":"F55+F59+F63","v":614.30758697702947},null,null,null,null,null,null,null,null,null,null,"Calculo"]
[]
[null,null,"CONTRIBUCION SOLCA (0.5%):",null,null,{"$f":"IF(F53=\"3 MESES SIN INTERESES\",$D$167*((0.5%/12)*3)+(0.5%*F71),(0.5%*F71))","v":100},null,null,null,null,null,null,null,null,null,null,"Calculo"]
[]
[]
[null,null,null,null,null,null,null,null,null,null,null,null,null,null,null,null,"Calculado"]
[null,null,"VALOR DE FINANCIAMIENTO:",null,null,{"$f":"+F34-F40","v":20000}]
[]
[null,null,"INTERESES:",null,null,{"$f":"+PAGARE!D5-'COTIZADOR (2)'!F71","v":-8270.6299125512924},null,null,null,null,null,null,null,null,null,null,"Calculado"]
[]
[]
[]
[]
[]
[]
[]
[]
[]
[]
[]
[]
[null,null,"DISPOSITIVOS",null,null,null,"AÑO",null,"VALOR LEGALES",null,"CIUDAD",null,null,"MES",null,null,"COLOR",null,"CÓDIGO COLOR","Min","Max","TASA","TASA","PRIMA US $","SÚPER BANCOS","S.S. Campesino","IVA","DERECHOS EMISIÓN","PRIMA TOTAL","MARCA SISE","CÓDIGO MARCA SISE","MARCA","CÓDIGO MARCA SISE","MODELO","CÓDIGO MODELO SISE","TIPO","GENERO","DIA","ESTADO CIVIL","% USO","MESES","GASTOS LEGALES",null,"tasa por producto","PAÍS DE ORIGEN",null,"% ENTRADA","% RESTANTE","VALOR RESTANTE","CALCULO DÍAS",null,"BIN","FECHA PAGO","EXTRAER1","EXTRAER 2"]
[null,null,"TRACKLINK INTERACTIVO 12",46.573333333333345,469.28,null,2018,null,37.184000000000005,null,"QUITO",null,null,"ENERO",null,null,"AMARILLO",null,1,0,0,4.3,{"$f":"+(V87/12)/100","v":3.5833333333333333E-3},{"$f":"ROUND((FORM!$F$101*$W$87),2)","v":35.83},{"$f":"ROUND(($X$87*3.5%),2)","v":1.25},{"$f":"+X87*0.5%","v":0.17915},{"$f":"SUM(X87:Z87)*12%","v":4.4710979999999996},0.04,{"$f":"SUM(X87:AB87)","v":41.770247999999995},"ALFA ROMEO",24,"ALFA ROMEO",24,146,1,"SEDAN","MASCULINO",1,"SOLTERO",5,12,"CORRIENTE","PERSONAL",0.156,"ALEMANIA",null,{"$f":"+F40/F34","v":0},{"$f":"100%-AU87","v":1},{"$f":"+F34-F40","v":20000},{"$f":"+F42/12/12","v":8.3333333333333329E-2},null,360041,16,{"$f":"MID(F64,1,6)","v":""},{"$f":"MID(F64,7,8)","v":""}]
[null,null,"TRACKLINK INTERACTIVO 24",33.553333333333335,592.48,null,2019,null,17.920000000000002,null,"GUAYAQUIL",null,null,"FEBRERO",null,null,"AZUL",null,2,0,24999,3.5,{"$f":"+(V88/12)/100","v":2.9166666666666668E-3},{"$f":"ROUND((FORM!$F$101*$W$88),2)","v":29.17},{"$f":"ROUND(($X$88*3.5%),2)","v":1.02},{"$f":"+X88*0.5%","v":0.14585000000000001},{"$f":"SUM(X88:Z88)*12%","v":3.6403020000000001},0.04,{"$f":"SUM(X88:AB88)","v":34.016151999999998},"AUDI",1,"ALFA ROMEO",24,155,2,"SEDAN","FEMENINO",2,"CASADO",10,{"$f":"AO87+12","v":24},"3 MESES SIN INTERESES","CORPORATIVO",0.11509999999999999,"ARGENTINA",null,null,null,null,null,null,361329,16]
[null,null,"TRACKLINK INTERACTIVO 36",29.213333333333335,715.68,null,2020,null,1.2,null,"CUENCA",null,null,"MARZO",null,null,"BEIGE",null,3,{"$f":"+U88+0.01","v":24999.01},39999,3,{"$f":"+(V89/12)/100","v":2.5000000000000001E-3},{"$f":"ROUND((FORM!$F$101*$W$89),2)","v":25},{"$f":"ROUND(($X$89*3.5%),2)","v":0.88},{"$f":"+X89*0.5%","v":0.125},{"$f":"SUM(X89:Z89)*12%","v":3.1205999999999996},0.04,{"$f":"SUM(X89:AB89)","v":29.165599999999998},"AUSTIN",26,"ALFA ROMEO",24,156,3,"SEDAN",null,3,"VIUDO",15,{"$f":"AO88+12","v":36},null,"EMPRESARIAL",0.1222,"BRASIL",null,null,null,null,null,null,361349,1]
[null,null,"TRACKLINK INTERACTIVO 48",27.043333333333337,962.08,null,2021,null,1000,null,"AMBATO",null,null,"ABRIL",null,null,"BLANCO",null,4,{"$f":"+U89+0.01","v":39999.01},200000,2.5,{"$f":"+(V90/12)/100","v":2.0833333333333333E-3},{"$f":"ROUND((FORM!$F$101*$W$90),2)","v":20.83},{"$f":"ROUND(($X$90*3.5%),2)","v":0.73},{"$f":"+X90*0.5%","v":0.10414999999999999},{"$f":"SUM(X90:Z90)*12%","v":2.5996979999999996},0.04,{"$f":"SUM(X90:AB90)","v":24.303847999999999},"BMW",2,"ALFA ROMEO",24,165,4,"SEDAN",null,4,"DIVORCIADO",20,{"$f":"AO89+12","v":48},null,"PYME",0.1149,"CANADÁ",null,null,null,null,null,null,362062,1]
[null,null,"TRACKLINK INTERACTIVO 60",25.741333333333337,1208.48,null,2022,null,1.1200000000000001,null,"IBARRA",null,null,"MAYO",null,null,"CAFÉ",null,5,null,null,null,null,null,null,null,null,null,null,"BUICK",81,"ALFA ROMEO",24,166,5,"SEDAN",null,5,"UNIÓN LIBRE",25,{"$f":"AO90+12","v":60},null,null,null,"CHINA",null,null,null,null,null,null,362620,1]
[null,null,"TRACKLINK CONTROL 12",54.04,388.64,419,null,null,44.8,null,"MANTA",null,null,"JUNIO",null,null,"CELESTE",null,6,null,null,null,null,null,null,null,null,null,null,"CHANGAN",83,"ALFA ROMEO",24,"SPIDER",6,"SEDAN",null,6,null,30,null,null,null,"tipo de cliente","CHILE",null,null,null,null,null,null,362621,1]
[null,null,"TRACKLINK CONTROL 24",39.620000000000005,511.84,null,null,null,{"$f":"IF(F11>4000,F11-4000,44.8)","v":44.8},null,"PORTOVIEJO",null,null,"JULIO",null,null,"CREMA",null,7,null,null,null,null,null,null,null,null,null,null,"CHEVROLET",3,"ALFA ROMEO",24,33,7,"SEDAN",null,7,null,35,null,null,null,"PERSONAL","COLOMBIA",null,null,null,null,null,null,362622,16]
[null,null,"TRACKLINK CONTROL 36",34.81333333333334,635.04,null,null,null,22.4,null,"MACHALA",null,null,"AGOSTO",null,null,"FUCSIA",null,8,null,null,null,null,null,null,null,null,null,null,"CHRYSLER",4,"ALFA ROMEO",24,"GIO",8,"SEDAN",null,8,null,40,null,null,null,"CORPORATIVO","ECUADOR",null,null,null,null,null,null,363999,16]
[null,null,"TRACKLINK CONTROL 48",32.410000000000004,881.44,null,null,null,56,null,"LOJA",null,null,"SEPTIEMBRE",null,null,"GRIS",null,9,"TIPO DE VEHÍCLO",null,null,null,null,null,null,null,null,null,"CITROEN",28,"ALFA ROMEO",24,164,9,"SEDAN",null,9,null,45,null,null,null,"EMPRESARIAL","ESPAÑA",null,null,null,null,null,null,364170,16]
[null,null,"TRACKLINK CONTROL 60",30.968000000000004,1127.8399999999999,{"$f":"+E91/48","v":25.176666666666666},null,null,null,null,"ALAMOR",null,null,"OCTUBRE",null,null,"LILA",null,10,"LIVIANO",null,null,null,null,null,null,null,null,null,"DACIA",29,"ALFA ROMEO",24,"GTV3",10,"SEDAN",null,10,null,50,null,null,null,"PYME","ESTADOS UNIDOS",null,null,null,null,null,null,364171,1]
[null,null,"TRACKLINK CONTROL PLUS 12",69.90666666666668,586.88,{"$f":"+(E92*1.05)","v":408.072},null,null,null,null,"ALAUSI",null,null,"NOVIEMBRE",null,null,"MORADO",null,11,"PESADO HASTA 7.5 TN",null,null,null,null,null,null,null,null,null,"DAEWOO",5,"ALFA ROMEO",24,145,11,"COUPE",null,11,null,55,null,null,null,null,"NORUEGA",null,null,null,null,null,null,364172,16]
[null,null,"TRACKLINK CONTROL PLUS 24",47.506666666666668,736.96,null,null,null,null,null,"AMBUQUI",null,null,"DICIEMBRE",null,null,"NARANJA",null,12,null,null,null,null,null,null,null,null,null,null,"DAIHATSU",6,"ALFA ROMEO",24,147,12,"SEDAN",null,12,null,60,null,null,null,null,"HONG KONG",null,null,null,null,null,null,364173,1]
[null,null,"TRACKLINK CONTROL PLUS 36",40.04,887.04,null,null,null,null,null,"ANTONIO ANTE",null,null,null,null,null,"NEGRO",null,13,null,null,null,null,null,null,null,null,null,null,"DATSUN",30,"AUDI",1,80,1,"SEDAN",null,13,null,65,null,null,null,null,"FRANCIA",null,null,null,null,null,null,364190,16]
[null,null,"TRACKLINK CONTROL PLUS 48",36.306666666666672,1187.2,null,null,null,null,null,"ANTONIO ANTE",null,null,null,null,null,"PLATA",null,14,null,null,null,null,null,null,null,null,null,null,"DEER",111,"AUDI",1,"A3",2,"SEDAN",null,14,null,70,null,null,null,null,"INGLATERRA",null,null,null,null,null,null,364234,16]
[null,null,"TRACKLINK CONTROL PLUS 60",34.06666666666667,1487.36,{"$f":"+E96/48","v":23.496666666666666},null,null,null,null,"ARCHIDONA",null,null,null,null,null,"PLATEADO",null,15,null,null,null,null,null,null,null,null,null,null,"DODGE",31,"AUDI",1,"TT COUPE 1.8 QUATTRO",3,"SEDAN",null,15,null,75,null,null,null,null,"ITALIA",null,null,null,null,null,null,364261,16]
[null,null,"TRACKLINK CONTROL TOTAL 12",88.573333333333338,null,null,null,null,null,null,"ARENILLAS",null,null,null,null,null,"PLOMO",null,16,null,null,null,null,null,null,null,null,null,null,"FIAT",7,"AUDI",1,"A4",4,"SEDAN",null,16,null,80,null,null,null,null,"JAPÓN",null,null,null,null,null,null,364444,1]
[null,null,"TRACKLINK CONTROL TOTAL 24",60.153333333333336,null,null,null,null,null,null,"ATACAMES",null,null,null,null,null,"ROJO",null,17,null,null,null,null,null,null,null,null,null,null,"FORD",8,"AUDI",1,"A6",5,"SEDAN",null,17,null,85,null,null,null,null,"COREA",null,null,null,null,null,null,364522,16]
[null,null,"TRACKLINK CONTROL TOTAL 36",50.680000000000007,null,null,null,null,null,null,"ATUNTAQUI",null,null,null,null,null,"VERDE",null,18,null,null,null,null,null,null,null,null,null,null,"FSO",77,"AUDI",1,808,6,"SEDAN",null,18,null,90,null,null,null,null,"MÉXICO",null,null,null,null,null,null,364700,1]
[null,null,"TRACKLINK CONTROL TOTAL 48",45.943333333333335,null,null,null,null,null,null,"AZOGUEZ",null,null,null,null,null,"VINO",null,19,null,null,null,null,null,null,null,null,null,null,"GMC",70,"AUDI",1,"A 62.8",7,"SEDAN",null,19,null,95,null,null,null,null,"PERU",null,null,null,null,null,null,364701,16]
[null,null,"TRACKLINK CONTROL TOTAL 60",43.101333333333336,null,null,null,null,null,null,"BABAHOYO",null,null,null,null,null,"BRONCE",null,20,null,null,null,null,null,null,null,null,null,null,"GREAT WALL",108,"AUDI",1,"ALLROAD",8,"SEDAN",null,20,null,100,null,null,null,null,"REPUBLICA CHECA",null,null,null,null,null,null,364702,16]
[null,null,"SHERLOC 12",53.2,null,{"$f":"+(E102*1.05)","v":0},null,null,870,null,"BAHÍA DE CARÁQUEZ",null,null,null,null,null,"CHAMPAGNE",null,21,null,null,null,null,null,null,null,null,null,null,"HONDA",9,"AUDI",1,"A8",9,"SEDAN",null,21,null,null,null,null,null,null,"RUSIA",null,null,null,null,null,null,364703,1]
[null,null,"SHERLOC 24",40.549999999999997,null,null,null,null,null,null,"BALAO",null,null,null,null,null,"DORADO",null,22,null,null,null,null,null,null,null,null,null,null,"HUMMER",115,"AUSTIN",26,"MINI 1000",1,"COUPE",null,22,null,null,null,null,null,null,"SUECIA",null,null,null,null,null,null,364716,1]
[null,null,"SHERLOC 36",36.340000000000003,null,null,null,null,null,null,"BALSAS",null,null,null,null,null,"HABANO",null,23,null,null,null,null,null,null,null,null,null,null,"HYUNDAI",10,"AUSTIN",26,"MINI CORD",2,"COUPE",null,23,null,null,null,null,null,null,"VENEZUELA",null,null,null,null,null,null,364717,1]
[null,null,"SHERLOC 48",31.9,null,null,null,null,null,null,"BALZAR",null,null,null,null,null,"MARRÓN",null,24,null,null,null,null,null,null,null,null,null,null,"INTERNATIONAL",44,"BMW",2,318,1,"SEDAN",null,24,null,null,null,null,null,null,"YUGOSLAVIA",null,null,null,null,null,null,364719,16]
[null,null,"SHERLOC 60",29.23,null,{"$f":"+E106/48","v":0},null,null,null,null,"BAÑOS",null,null,null,null,null,"STRATO",null,25,null,null,null,null,null,null,null,null,null,null,"ISUZU",34,"BMW",2,"330I",2,"SEDAN",null,25,null,null,null,null,null,null,null,null,null,null,null,null,null,365001,16]
[null,null,"HUNTER LOJACK 12",41.887999999999998,null,null,null,null,null,null,"BIBLIAN",null,null,null,null,null,"VIOLETA",null,26,null,null,null,null,null,null,null,null,null,null,"JAGUAR",35,"BMW",2,"328I",3,"SEDAN",null,26,null,null,null,null,null,null,null,null,null,null,null,null,null,365147,16]
[null,null,"HUNTER LOJACK 24",33.6,null,null,null,null,null,null,"BOLÍVAR",null,null,null,null,null,"TURQUESA",null,27,null,null,null,null,null,null,null,null,null,null,"JEEP",71,"BMW",2,"325I",4,"SEDAN",null,27,null,null,null,null,null,null,null,null,null,null,null,null,null,365166,1]
[null,null,"HUNTER LOJACK 36",30.24,null,null,null,null,null,null,"BUENA FE",null,null,null,null,null,"ROSADO",null,28,null,null,null,null,null,null,null,null,null,null,"KIA",11,"BMW",2,"X5 4X4 5P",5,"JEEP",null,28,null,null,null,null,null,null,null,null,null,null,null,null,null,365167,1]
[null,null,"HUNTER LOJACK 48",29.12,null,null,null,null,null,null,"CALUMA",null,null,null,null,null,"ARENA",null,29,null,null,null,null,null,null,null,null,null,null,"LADA",13,"BMW",2,"528I",6,"SEDAN",null,29,null,null,null,null,null,null,null,null,null,null,null,null,null,365168,16]
[null,null,"HUNTER LOJACK 60",28,null,null,null,null,null,null,"CAÑAR",null,null,null,null,null,"ILUSIÓN",null,30,null,null,null,null,null,null,null,null,null,null,"LANCIA",36,"BMW",2,"316I",7,"SEDAN",null,30,null,null,null,null,null,null,null,null,null,null,null,null,null,365169,1]
[null,null,"H. MONITOREO BASICO 12",{"$f":"616/12","v":51.333333333333336},null,null,null,null,null,null,"CARIAMANGA",null,null,null,null,null,"ROBLE",null,31,null,null,null,null,null,null,null,null,null,null,"LAND ROVER",12,"BMW",2,"320I",8,"SEDAN",null,31,null,null,null,null,null,null,null,null,null,null,null,null,null,365181,1]
[null,null,"H. MONITOREO BASICO 24",{"$f":"952/24","v":39.666666666666664},null,null,null,null,null,null,"CATAMAYO",null,null,null,null,null,"MOSTAZA",null,32,null,null,null,null,null,null,null,null,null,null,"LEXUS",37,"BMW",2,"323I",9,"SEDAN",null,null,null,null,null,null,null,null,null,null,null,null,null,null,null,365420,1]
[null,null,"H. MONITOREO BASICO 36",{"$f":"1288/36","v":35.777777777777779},null,null,null,null,null,null,"CAYAMBE",null,null,null,null,null,null,null,null,null,null,null,null,null,null,null,null,null,null,"LINCOLN",38,"BMW",2,"523I",10,"SEDAN",null,null,null,null,null,null,null,null,null,null,null,null,null,null,null,365421,16]
[null,null,"H. MONITOREO BASICO 48",{"$f":"1624/48","v":33.833333333333336},null,null,null,null,null,null,"CELICA",null,null,null,null,null,null,null,null,null,null,null,null,null,null,null,null,null,null,"MAHINDRA",101,"BMW",2,"525I",11,"SEDAN",null,null,null,null,null,null,null,null,null,null,null,null,null,null,null,365422,1]
[null,null,"H. MONITOREO BASICO 60",{"$f":"1960/60","v":32.666666666666664},null,null,null,null,null,null,"CHICA",null,null,null,null,null,null,null,null,null,null,null,null,null,null,null,null,null,null,"MAZDA",14,"BMW",2,"Z3",12,"COUPE",null,null,null,null,null,null,null,null,null,null,null,null,null,null,null,365423,16]
[null,null,"H. MONITOREO BÁSICO GOLDEN 12",{"$f":"768.4/12","v":64.033333333333331},null,null,null,null,null,null,"CHIMBO",null,null,null,null,null,null,null,null,null,null,null,null,null,null,null,null,null,null,"MERCEDES BENZ",15,"BMW",2,"Z8",13,"COUPE",null,null,null,null,null,null,null,null,null,null,null,null,null,null,null,365424,16]
[null,null,"H. MONITOREO BÁSICO GOLDEN 24",{"$f":"1104.4/24","v":46.016666666666673},null,null,null,null,null,null,"CHONE",null,null,null,null,null,null,null,null,null,null,null,null,null,null,null,null,null,null,"MITSUBISHI",16,"BMW",2,"M3",14,"COUPE",null,null,null,null,null,null,null,null,null,null,null,null,null,null,null,365425,1]
[null,null,"H. MONITOREO BÁSICO GOLDEN 36",{"$f":"1440.4/36","v":40.011111111111113},null,null,null,null,null,null,"COCA",null,null,null,null,null,null,null,null,null,null,null,null,null,null,null,null,null,null,"NISSAN",17,"BMW",2,"M5",15,"COUPE",null,null,null,null,null,null,null,null,null,null,null,null,null,null,null,365427,1]
[null,null,"H. MONITOREO BÁSICO GOLDEN 48",{"$f":"1776.4/48","v":37.008333333333333},null,null,null,null,null,null,"CONCORDIA",null,null,null,null,null,null,null,null,null,null,null,null,null,null,null,null,null,null,"OLDSMOBIL",73,"BMW",2,520,16,"SEDAN",null,null,null,null,null,null,null,null,null,null,null,null,null,null,null,365428,1]
[null,null,"H. MONITOREO BÁSICO GOLDEN 60",{"$f":"2112.4/60","v":35.206666666666671},null,null,null,null,null,null,"COTACACHI",null,null,null,null,null,null,null,null,null,null,null,null,null,null,null,null,null,null,"OLTCIT",40,"BMW",2,"530IA",17,"SEDAN",null,null,null,null,null,null,null,null,null,null,null,null,null,null,null,365429,16]
[null,null,"MARESA SATELITAL BY HUNTER 12",{"$f":"616/12","v":51.333333333333336},null,null,null,null,null,null,"CUMBAYÁ",null,null,null,null,null,null,null,null,null,null,null,null,null,null,null,null,null,null,"PEUGEOT",18,"BMW",2,"318TI",18,"COUPE",null,null,null,null,null,null,null,null,null,null,null,null,null,null,null,365453,16]
[null,null,"MARESA SATELITAL BY HUNTER 24",{"$f":"968.8/24","v":40.366666666666667},null,null,null,null,null,null,"DAULE",null,null,null,null,null,null,null,null,null,null,null,null,null,null,null,null,null,null,"PLYMOUTH",54,"BMW",2,740,19,"SEDAN",null,null,null,null,null,null,null,null,null,null,null,null,null,null,null,365454,16]
[null,null,"MARESA SATELITAL BY HUNTER 36",{"$f":"1338.4/36","v":37.177777777777777},null,null,null,null,null,null,"DURAN",null,null,null,null,null,null,null,null,null,null,null,null,null,null,null,null,null,null,"PORCHE",56,"BMW",2,1602,21,"SEDAN"]
[null,null,"MARESA SATELITAL BY HUNTER 48",{"$f":"1708/48","v":35.583333333333336},null,null,null,null,null,null,"EL ÁNGEL",null,null,null,null,null,null,null,null,null,null,null,null,null,null,null,null,null,null,"RENAULT",19,"BMW",2,366,22,"SEDAN"]
[null,null,"MARESA SATELITAL BY HUNTER 60",{"$f":"2077.6/60","v":34.626666666666665},null,null,null,null,null,null,"EL CARMEN",null,null,null,null,null,null,null,null,null,null,null,null,null,null,null,null,null,null,"SAAB",45,"BMW",2,530,23,"SEDAN"]
[null,null,null,null,null,null,null,null,null,null,"EL CORAZÓN",null,null,null,null,null,null,null,null,null,null,null,null,null,null,null,null,null,null,"SAEHAN",57,"BMW",2,540,25,"SEDAN"]
[null,null,null,null,null,null,null,null,null,null,"EL EMPALME",null,null,null,null,null,null,null,null,null,null,null,null,null,null,null,null,null,null,"SAMSUNG",74,"BMW",2,"318IS",26,"SEDAN"]
[null,null,null,null,null,null,null,null,null,null,"EL GUABO",null,null,null,null,null,null,null,null,null,null,null,null,null,null,null,null,null,null,"SANGYONG",42,"BMW",2,"318I LIMUSIN",27,"SEDAN"]
[null,null,null,null,null,null,null,null,null,null,"EL NARANJAL",null,null,null,null,null,null,null,null,null,null,null,null,null,null,null,null,null,null,"SEAT",105,"BMW",2,"Z4",29,"COUPE"]
[null,null,"Sin Dispositivo",null,null,null,null,null,null,null,"EL TAMBO",null,null,null,null,null,null,null,null,null,null,null,null,null,null,null,null,null,null,"SKODA",20,"BMW",2,"X3",31,"JEEP"]
[null,null,"H. MONITOREO BASICO",null,null,null,null,null,null,null,"EL TRIUNFO",null,null,null,null,null,null,null,null,null,null,null,null,null,null,null,null,null,null,"SUBARU",58,"BUICK",81,"CENTURY",1,"SEDAN"]
[null,null,"H. MONITOREO BÁSICO GOLDEN",null,null,null,null,null,null,null,"ESMERALDAS",null,null,null,null,null,null,null,null,null,null,null,null,null,null,null,null,null,null,"SUZUKI",60,"CHANGAN",83,"SC1011CG",1,"PICK-UP"]
[null,null,"MARESA SATELITAL BY HUNTER",null,null,null,null,null,null,null,"FLAVIO ALFARO",null,null,null,null,null,null,null,null,null,null,null,null,null,null,null,null,null,null,"TALBOT",59,"CHANGAN",83,"MINI VAN",2,"MINI VAN"]
[null,null,null,null,null,null,null,null,null,null,"GIRÓN",null,null,null,null,null,null,null,null,null,null,null,null,null,null,null,null,null,null,"TATA",75,"CHANGAN",83,"SC1018AA100",3,"PICK-UP"]
[null,null,null,null,null,null,null,null,null,null,"GONZALO PIZARRO",null,null,null,null,null,null,null,null,null,null,null,null,null,null,null,null,null,null,"TOYOTA",21,"CHEVROLET",3,"FORSA",1,"COUPE"]
[null,null,null,null,null,null,null,null,null,null,"GUALACEO",null,null,null,null,null,null,null,null,null,null,null,null,null,null,null,null,null,null,"VOLKSWAGEN",22,"CHEVROLET",3,"CORSA 3P",2,"COUPE"]
[]
[]
[null,null,null,null,null,null,null,null,null,null,"GUALAQUIZA",null,null,null,null,null,null,null,null,null,null,null,null,null,null,null,null,null,null,"VOLVO",23,"CHEVROLET",3,"CORSA 4P",3,"SEDAN"]
[null,null,null,null,null,null,null,null,null,null,"GUAMOTE",null,null,null,null,null,null,null,null,null,null,null,null,null,null,null,null,null,null,"WORLDSTAR",99,"CHEVROLET",3,"CORSA 5P",4,"SEDAN"]
[null,null,null,null,null,null,null,null,null,null,"GUANO",null,null,null,null,null,null,null,null,null,null,null,null,null,null,null,null,null,null,"ZASTAVA",61,"CHEVROLET",3,"CORSA SPORT",5,"SEDAN"]
[null,null,null,null,null,null,null,null,null,null,"GUARANDA",null,null,null,null,null,null,null,null,null,null,null,null,null,null,null,null,null,null,null,null,"CHEVROLET",3,"CORSA P/U 1600",6,"PICK-UP"]
[null,null,null,null,null,null,null,null,null,null,"GUAYLLABAMBA",null,null,null,null,null,null,null,null,null,null,null,null,null,null,null,null,null,null,null,null,"CHEVROLET",3,"SAN REMO",7,"SEDAN"]
[null,null,null,null,null,null,null,null,null,null,"HUAQUILLAS",null,null,null,null,null,null,null,null,null,null,null,null,null,null,null,null,null,null,null,null,"CHEVROLET",3,"MONZA",8,"SEDAN"]
[null,null,null,null,null,null,null,null,null,null,"JIPIJAPA",null,null,null,null,null,null,null,null,null,null,null,null,null,null,null,null,null,null,null,null,"CHEVROLET",3,"SWIFT",9,"SEDAN"]
[null,null,null,null,null,null,null,null,null,null,"JUNIN",null,null,null,null,null,null,null,null,null,null,null,null,null,null,null,null,null,null,null,null,"CHEVROLET",3,"SWIFT EMOTION",10,"SEDAN"]
[null,null,null,null,null,null,null,null,null,null,"LA CONCORDIA",null,null,null,null,null,null,null,null,null,null,null,null,null,null,null,null,null,null,null,null,"CHEVROLET",3,"ESTEEM 4P",11,"SEDAN"]
[null,null,null,null,null,null,null,null,null,null,"LA MANA",null,null,null,null,null,null,null,null,null,null,null,null,null,null,null,null,null,null,null,null,"CHEVROLET",3,"ESTEEM S. WAGON",12,"STATION WAGON"]
[null,null,null,null,null,null,null,null,null,null,"LA UNIÓN",null,null,null,null,null,null,null,null,null,null,null,null,null,null,null,null,null,null,null,null,"CHEVROLET",3,"LUV 4X2 C/S",13,"PICK-UP"]
[null,null,null,null,null,null,null,null,null,null,"LAGO AGRIO",null,null,null,null,null,null,null,null,null,null,null,null,null,null,null,null,null,null,null,null,"CHEVROLET",3,"LUV 4X2 D/C",14,"PICK-UP"]
[null,null,null,null,null,null,null,null,null,null,"LAS LAJAS",null,null,null,null,null,null,null,null,null,null,null,null,null,null,null,null,null,null,null,null,"CHEVROLET",3,"LUV 4X4 C/S",15,"PICK-UP"]
[null,null,"Valor del vehículo",{"$f":"+$F$34","v":20000},null,null,null,null,null,null,"LASSO",null,null,null,null,null,null,null,null,null,null,null,null,null,null,null,null,null,null,null,null,"CHEVROLET",3,"LUV 4X4 D/C",16,"PICK-UP"]
[null,null,"INSCRIPCIÓN EN REGISTRO MERCANTIL",null,null,null,null,null,null,null,"LATACUNGA",null,null,null,null,null,null,null,null,null,null,null,null,null,null,null,null,null,null,null,null,"CHEVROLET",3,"VITARA 3P",17,"JEEP"]
[null,null,"VALOR BASE POR CONTRATO",25,null,null,null,null,null,null,"LIBERTAD",null,null,null,null,null,null,null,null,null,null,null,null,null,null,null,null,null,null,null,null,"CHEVROLET",3,"VITARA 5P",18,"JEEP"]
[null,null,"CESIÓN DE DERECHOS",30,null,null,null,null,null,null,"LIMÓN",null,null,null,null,null,null,null,null,null,null,null,null,null,null,null,null,null,null,null,null,"CHEVROLET",3,"RODEO 4X2",19,"JEEP"]
[null,null,"0.5% SOBRE LA CUANTÍA DEL CONTRATO (PRECIO DE VENTA).",{"$f":"D158*0.5%","v":100},null,null,null,null,null,null,"QUEVEDO",null,null,null,null,null,null,null,null,null,null,null,null,null,null,null,null,null,null,null,null,"CHEVROLET",3,"RODEO 4X4",20,"JEEP"]
[null,null,"TOTAL",{"$f":"SUM(D160:D162)","v":155},null,null,null,null,null,null,"LOS BANCOS",null,null,null,null,null,null,null,null,null,null,null,null,null,null,null,null,null,null,null,null,"CHEVROLET",3,"CAVALIER STD",21,"SEDAN"]
[null,null,"OTROS GASTOS",null,null,null,null,null,null,null,"MACARA",null,null,null,null,null,null,null,null,null,null,null,null,null,null,null,null,null,null,null,null,"CHEVROLET",3,"CAVALIER DLX",22,"SEDAN"]
[null,null,"TRAMITACIÓN LEGAL, SERVICIO DE TERCERO",{"$f":"162.4+30","v":192.4},null,null,null,null,null,null,"MACAS",null,null,null,null,null,null,null,null,null,null,null,null,null,null,null,null,null,null,null,null,"CHEVROLET",3,"SÚPER CARRY PICK UP",23,"PICK-UP"]
[null,null,null,null,null,null,null,null,null,null,"MACHACHI",null,null,null,null,null,null,null,null,null,null,null,null,null,null,null,null,null,null,null,null,"CHEVROLET",3,"GRAND BLAZER 3P",26,"JEEP"]
[null,null,"Tarifa gastos legales",{"$f":"+D163+D165","v":347.4},null,null,null,null,null,null,"MÉNDEZ",null,null,null,null,null,null,null,null,null,null,null,null,null,null,null,null,null,null,null,null,"CHEVROLET",3,"GRAND BLAZER 5P",27,"JEEP"]
[null,null,null,null,null,null,null,null,null,null,"MILAGRO",null,null,null,null,null,null,null,null,null,null,null,null,null,null,null,null,null,null,null,null,"CHEVROLET",3,"TAHOE 5P. USA",28,"JEEP"]
[null,null,null,null,null,null,null,null,null,null,"MIRA",null,null,null,null,null,null,null,null,null,null,null,null,null,null,null,null,null,null,null,null,"CHEVROLET",3,"BLAZER 4X4",29,"JEEP"]
[null,null,null,null,null,null,null,null,null,null,"MOCACHE",null,null,null,null,null,null,null,null,null,null,null,null,null,null,null,null,null,null,null,null,"CHEVROLET",3,"BLAZER 4X2",30,"JEEP"]
[null,null,"Declaración unico vehículo",null,null,null,null,null,null,null,"MONTALVO",null,null,null,null,null,null,null,null,null,null,null,null,null,null,null,null,null,null,null,null,"CHEVROLET",3,"SILVERADO",31,"PICK-UP"]
[null,null,"Si",null,null,null,null,null,null,null,"MONTECRISTI",null,null,null,null,null,null,null,null,null,null,null,null,null,null,null,null,null,null,null,null,"CHEVROLET",3,"CHEYENNE",32,"PICK-UP"]
[null,null,"No",null,null,null,null,null,null,null,"MONTUFAR",null,null,null,null,null,null,null,null,null,null,null,null,null,null,null,null,null,null,null,null,"CHEVROLET",3,"TROOPER 2.300 3P.",33,"JEEP"]
[null,null,null,null,null,null,null,null,null,null,"MUISNE",null,null,null,null,null,null,null,null,null,null,null,null,null,null,null,null,null,null,null,null,"CHEVROLET",3,"TROOPER 3P",34,"JEEP"]
[null,null,null,null,null,null,null,null,null,null,"NARANJITO",null,null,null,null,null,null,null,null,null,null,null,null,null,null,null,null,null,null,null,null,"CHEVROLET",3,"TROOPER 5P",35,"JEEP"]
[null,null,null,null,null,null,null,null,null,null,"NUEVA LOJA",null,null,null,null,null,null,null,null,null,null,null,null,null,null,null,null,null,null,null,null,"CHEVROLET",3,"GRAND VITARA 3P",36,"JEEP"]
[null,null,null,null,null,null,null,null,null,null,"OTAVALO",null,null,null,null,null,null,null,null,null,null,null,null,null,null,null,null,null,null,null,null,"CHEVROLET",3,"GRAND VITARA 5P",37,"JEEP"]
[null,null,null,null,null,null,null,null,null,null,"PAJAN",null,null,null,null,null,null,null,null,null,null,null,null,null,null,null,null,null,null,null,null,"CHEVROLET",3,"ALTO 5P",38,"SEDAN"]
[null,null,null,null,null,null,null,null,null,null,"PALENQUE",null,null,null,null,null,null,null,null,null,null,null,null,null,null,null,null,null,null,null,null,"CHEVROLET",3,"ASTRA 2P",39,"COUPE"]
[null,null,null,null,null,null,null,null,null,null,"PALESTINA",null,null,null,null,null,null,null,null,null,null,null,null,null,null,null,null,null,null,null,null,"CHEVROLET",3,"ASTRA 4P",40,"SEDAN"]
[null,null,null,null,null,null,null,null,null,null,"PALLATANGA",null,null,null,null,null,null,null,null,null,null,null,null,null,null,null,null,null,null,null,null,"CHEVROLET",3,"ASKA",41,"SEDAN"]
[null,null,null,null,null,null,null,null,null,null,"PASAJE",null,null,null,null,null,null,null,null,null,null,null,null,null,null,null,null,null,null,null,null,"CHEVROLET",3,"ASTROVAN",42,"MINI VAN"]
[null,null,null,null,null,null,null,null,null,null,"PASTAZA",null,null,null,null,null,null,null,null,null,null,null,null,null,null,null,null,null,null,null,null,"CHEVROLET",3,"CHEVETTE",44,"COUPE"]
[null,null,null,null,null,null,null,null,null,null,"PATATE",null,null,null,null,null,null,null,null,null,null,null,null,null,null,null,null,null,null,null,null,"CHEVROLET",3,"CONDOR",45,"COUPE"]
[null,null,null,null,null,null,null,null,null,null,"PAUTE",null,null,null,null,null,null,null,null,null,null,null,null,null,null,null,null,null,null,null,null,"CHEVROLET",3,"CORSICA",46,"SEDAN"]
[null,null,null,null,null,null,null,null,null,null,"PEDERNALES",null,null,null,null,null,null,null,null,null,null,null,null,null,null,null,null,null,null,null,null,"CHEVROLET",3,"GEMINI",47,"SEDAN"]
[null,null,null,null,null,null,null,null,null,null,"PEDRO CARBO",null,null,null,null,null,null,null,null,null,null,null,null,null,null,null,null,null,null,null,null,"CHEVROLET",3,"IMPALA",48,"SEDAN"]
[null,null,null,null,null,null,null,null,null,null,"PELILEO",null,null,null,null,null,null,null,null,null,null,null,null,null,null,null,null,null,null,null,null,"CHEVROLET",3,"VEGA",49,"SEDAN"]
[null,null,null,null,null,null,null,null,null,null,"PIFO",null,null,null,null,null,null,null,null,null,null,null,null,null,null,null,null,null,null,null,null,"CHEVROLET",3,"ZAFIRA 5P",51,"MINI VAN"]
[null,null,null,null,null,null,null,null,null,null,"PILLARO",null,null,null,null,null,null,null,null,null,null,null,null,null,null,null,null,null,null,null,null,"CHEVROLET",3,"CARGO",52,"PICK-UP"]
[null,null,null,null,null,null,null,null,null,null,"PIMAMPIRO",null,null,null,null,null,null,null,null,null,null,null,null,null,null,null,null,null,null,null,null,"CHEVROLET",3,"CHEVY VAN",53,"MINI VAN"]
[null,null,null,null,null,null,null,null,null,null,"PINDAL",null,null,null,null,null,null,null,null,null,null,null,null,null,null,null,null,null,null,null,null,"CHEVROLET",3,"MINI BLAZER 4X2",55,"JEEP"]
[null,null,null,null,null,null,null,null,null,null,"PIÑAS",null,null,null,null,null,null,null,null,null,null,null,null,null,null,null,null,null,null,null,null,"CHEVROLET",3,"MINI BLAZER 4X4",56,"JEEP"]
[null,null,null,null,null,null,null,null,null,null,"PLAYAS",null,null,null,null,null,null,null,null,null,null,null,null,null,null,null,null,null,null,null,null,"CHEVROLET",3,"CITATION",57,"SEDAN"]
[null,null,null,null,null,null,null,null,null,null,"PORTOVELO",null,null,null,null,null,null,null,null,null,null,null,null,null,null,null,null,null,null,null,null,"CHEVROLET",3,"C10",60,"PICK-UP"]
[null,null,null,null,null,null,null,null,null,null,"PUEBLO VIEJO",null,null,null,null,null,null,null,null,null,null,null,null,null,null,null,null,null,null,null,null,"CHEVROLET",3,"CREW CAB 4X4",65,"PICK-UP"]
[null,null,null,null,null,null,null,null,null,null,"PUEMBO",null,null,null,null,null,null,null,null,null,null,null,null,null,null,null,null,null,null,null,null,"CHEVROLET",3,"C1500",66,"PICK-UP"]
[null,null,null,null,null,null,null,null,null,null,"PUERTO CAYO",null,null,null,null,null,null,null,null,null,null,null,null,null,null,null,null,null,null,null,null,"CHEVROLET",3,"AVALANCHE",68,"PICK-UP"]
[null,null,null,null,null,null,null,null,null,null,"PUERTO LOPEZ",null,null,null,null,null,null,null,null,null,null,null,null,null,null,null,null,null,null,null,null,"CHEVROLET",3,"CORSA EVOLUTION",70,"SEDAN"]
[null,null,null,null,null,null,null,null,null,null,"PUERTO QUITO",null,null,null,null,null,null,null,null,null,null,null,null,null,null,null,null,null,null,null,null,"CHEVROLET",3,"TRAIL BLAZER 4X4",71,"JEEP"]
[null,null,null,null,null,null,null,null,null,null,"PUJILI",null,null,null,null,null,null,null,null,null,null,null,null,null,null,null,null,null,null,null,null,"CHEVROLET",3,"TRAIL BLAZER 4X2",72,"JEEP"]
[null,null,null,null,null,null,null,null,null,null,"PUYANGO",null,null,null,null,null,null,null,null,null,null,null,null,null,null,null,null,null,null,null,null,"CHEVROLET",3,"ASTRA 3P",73,"COUPE"]
[null,null,null,null,null,null,null,null,null,null,"PUYO",null,null,null,null,null,null,null,null,null,null,null,null,null,null,null,null,null,null,null,null,"CHEVROLET",3,"CORSA WIND",74,"SEDAN"]
[null,null,null,null,null,null,null,null,null,null,"QUERO",null,null,null,null,null,null,null,null,null,null,null,null,null,null,null,null,null,null,null,null,"CHEVROLET",3,"JIMNY 4X4",75,"JEEP"]
[null,null,null,null,null,null,null,null,null,null,"QUININDE",null,null,null,null,null,null,null,null,null,null,null,null,null,null,null,null,null,null,null,null,"CHEVROLET",3,"SPARK",76,"SEDAN"]
[null,null,null,null,null,null,null,null,null,null,"QUITO",null,null,null,null,null,null,null,null,null,null,null,null,null,null,null,null,null,null,null,null,"CHEVROLET",3,"CHEYENNE 4X2",77,"PICK-UP"]
[null,null,null,null,null,null,null,null,null,null,"RIOBAMBA",null,null,null,null,null,null,null,null,null,null,null,null,null,null,null,null,null,null,null,null,"CHEVROLET",3,"CHEYENNE 4X4",78,"PICK-UP"]
[null,null,null,null,null,null,null,null,null,null,"ROCAFUERTE",null,null,null,null,null,null,null,null,null,null,null,null,null,null,null,null,null,null,null,null,"CHEVROLET",3,"OPTRA",79,"SEDAN"]
[null,null,null,null,null,null,null,null,null,null,"SALCEDO",null,null,null,null,null,null,null,null,null,null,null,null,null,null,null,null,null,null,null,null,"CHEVROLET",3,"GRAND VITARA 5P XL7 4X4",80,"JEEP"]
[null,null,null,null,null,null,null,null,null,null,"SALINAS",null,null,null,null,null,null,null,null,null,null,null,null,null,null,null,null,null,null,null,null,"CHEVROLET",3,"GRAND VITARA 5P XL7 4X2",81,"JEEP"]
[null,null,null,null,null,null,null,null,null,null,"SAMBORONDON",null,null,null,null,null,null,null,null,null,null,null,null,null,null,null,null,null,null,null,null,"CHEVROLET",3,"LUV D-MAX C/S 4X2",82,"PICK-UP"]
[null,null,null,null,null,null,null,null,null,null,"SAME",null,null,null,null,null,null,null,null,null,null,null,null,null,null,null,null,null,null,null,null,"CHEVROLET",3,"LUV D-MAX C/D 4X2",83,"PICK-UP"]
[null,null,null,null,null,null,null,null,null,null,"SAN CAMILO",null,null,null,null,null,null,null,null,null,null,null,null,null,null,null,null,null,null,null,null,"CHEVROLET",3,"LUV D-MAX C/S 4X4",84,"PICK-UP"]
[null,null,null,null,null,null,null,null,null,null,"SAN GABRIEL",null,null,null,null,null,null,null,null,null,null,null,null,null,null,null,null,null,null,null,null,"CHEVROLET",3,"LUV D-MAX C/D 4X4",85,"PICK-UP"]
[null,null,null,null,null,null,null,null,null,null,"SAN LORENZO",null,null,null,null,null,null,null,null,null,null,null,null,null,null,null,null,null,null,null,null,"CHRYSLER",4,"GRAND CHEROKEE LAREDO 4X4",1,"JEEP"]
[null,null,null,null,null,null,null,null,null,null,"SAN MIGUEL",null,null,null,null,null,null,null,null,null,null,null,null,null,null,null,null,null,null,null,null,"CHRYSLER",4,"GRAND CHEROKEE LIMITED 4X4",2,"JEEP"]
[null,null,null,null,null,null,null,null,null,null,"SAN RAFAEL",null,null,null,null,null,null,null,null,null,null,null,null,null,null,null,null,null,null,null,null,"CHRYSLER",4,"CHEROKEE LAREDO",3,"JEEP"]
[null,null,null,null,null,null,null,null,null,null,"SAN VICENTE",null,null,null,null,null,null,null,null,null,null,null,null,null,null,null,null,null,null,null,null,"CHRYSLER",4,"NEON 2000CC",4,"SEDAN"]
[null,null,null,null,null,null,null,null,null,null,"SANGOLQUI",null,null,null,null,null,null,null,null,null,null,null,null,null,null,null,null,null,null,null,null,"CHRYSLER",4,"CARAVAN",5,"MINI VAN"]
[null,null,null,null,null,null,null,null,null,null,"SANTA ANA",null,null,null,null,null,null,null,null,null,null,null,null,null,null,null,null,null,null,null,null,"CHRYSLER",4,"GRAND CARAVAN",6,"MINI VAN"]
[null,null,null,null,null,null,null,null,null,null,"SANTA CRUZ",null,null,null,null,null,null,null,null,null,null,null,null,null,null,null,null,null,null,null,null,"CHRYSLER",4,"LEBARON",7,"SEDAN"]
[null,null,null,null,null,null,null,null,null,null,"SANTA ELENA",null,null,null,null,null,null,null,null,null,null,null,null,null,null,null,null,null,null,null,null,"CHRYSLER",4,"LIBERTY",8,"JEEP"]
[null,null,null,null,null,null,null,null,null,null,"SANTA ISABEL",null,null,null,null,null,null,null,null,null,null,null,null,null,null,null,null,null,null,null,null,"CHRYSLER",4,"STRATUS",9,"SEDAN"]
[null,null,null,null,null,null,null,null,null,null,"SANTA ISABEL",null,null,null,null,null,null,null,null,null,null,null,null,null,null,null,null,null,null,null,null,"CHRYSLER",4,"RENEGADO",10,"JEEP"]
[null,null,null,null,null,null,null,null,null,null,"SANTA ROSA",null,null,null,null,null,null,null,null,null,null,null,null,null,null,null,null,null,null,null,null,"CHRYSLER",4,"TOWN & COUNTRY",11,"PICK-UP"]
[null,null,null,null,null,null,null,null,null,null,"SANTO DOMINGO",null,null,null,null,null,null,null,null,null,null,null,null,null,null,null,null,null,null,null,null,"CITROEN",28,"AX GT",1,"SEDAN"]
[null,null,null,null,null,null,null,null,null,null,"SAQUISILI",null,null,null,null,null,null,null,null,null,null,null,null,null,null,null,null,null,null,null,null,"CITROEN",28,"BERLINGO",2,"SEDAN"]
[null,null,null,null,null,null,null,null,null,null,"SARAGURO",null,null,null,null,null,null,null,null,null,null,null,null,null,null,null,null,null,null,null,null,"CITROEN",28,"SAXO SX",3,"SEDAN"]
[null,null,null,null,null,null,null,null,null,null,"SHUSHUFINDI",null,null,null,null,null,null,null,null,null,null,null,null,null,null,null,null,null,null,null,null,"CITROEN",28,"XANTIA",4,"SEDAN"]
[null,null,null,null,null,null,null,null,null,null,"SIGCHOS",null,null,null,null,null,null,null,null,null,null,null,null,null,null,null,null,null,null,null,null,"CITROEN",28,"XSARA VTS",5,"SEDAN"]
[null,null,null,null,null,null,null,null,null,null,"SIGSIG",null,null,null,null,null,null,null,null,null,null,null,null,null,null,null,null,null,null,null,null,"CITROEN",28,"ZX VOLCANE",6,"SEDAN"]
[null,null,null,null,null,null,null,null,null,null,"SUCRE",null,null,null,null,null,null,null,null,null,null,null,null,null,null,null,null,null,null,null,null,"CITROEN",28,"ALLUER 5P",7,"STATION WAGON"]
[null,null,null,null,null,null,null,null,null,null,"SUCUA",null,null,null,null,null,null,null,null,null,null,null,null,null,null,null,null,null,null,null,null,"CITROEN",28,"XSARA PICASSO",8,"SEDAN"]
[null,null,null,null,null,null,null,null,null,null,"SUCUMBIOS",null,null,null,null,null,null,null,null,null,null,null,null,null,null,null,null,null,null,null,null,"CITROEN",28,"C3 SX 14I",9,"SEDAN"]
[null,null,null,null,null,null,null,null,null,null,"TABABELA",null,null,null,null,null,null,null,null,null,null,null,null,null,null,null,null,null,null,null,null,"DACIA",29,"1304 DROP-SIDE",1,"PICK-UP"]
[null,null,null,null,null,null,null,null,null,null,"TABACUNDO",null,null,null,null,null,null,null,null,null,null,null,null,null,null,null,null,null,null,null,null,"DACIA",29,"BREAK",2,"SEDAN"]
[null,null,null,null,null,null,null,null,null,null,"TAMBILLO",null,null,null,null,null,null,null,null,null,null,null,null,null,null,null,null,null,null,null,null,"DACIA",29,"RAPSODIE",3,"SEDAN"]
[null,null,null,null,null,null,null,null,null,null,"TENA",null,null,null,null,null,null,null,null,null,null,null,null,null,null,null,null,null,null,null,null,"DAEWOO",5,"TICO 5P. SX",1,"SEDAN"]
[null,null,null,null,null,null,null,null,null,null,"TONSUPA",null,null,null,null,null,null,null,null,null,null,null,null,null,null,null,null,null,null,null,null,"DAEWOO",5,"MATIZ",2,"SEDAN"]
[null,null,null,null,null,null,null,null,null,null,"TOSAGUA",null,null,null,null,null,null,null,null,null,null,null,null,null,null,null,null,null,null,null,null,"DAEWOO",5,"LANOS 4P",3,"SEDAN"]
[null,null,null,null,null,null,null,null,null,null,"TULCAN",null,null,null,null,null,null,null,null,null,null,null,null,null,null,null,null,null,null,null,null,"DAEWOO",5,"LANOS 5P",4,"SEDAN"]
[null,null,null,null,null,null,null,null,null,null,"TUMBACO",null,null,null,null,null,null,null,null,null,null,null,null,null,null,null,null,null,null,null,null,"DAEWOO",5,"LANOS 3P",5,"SEDAN"]
[null,null,null,null,null,null,null,null,null,null,"URCUQUI",null,null,null,null,null,null,null,null,null,null,null,null,null,null,null,null,null,null,null,null,"DAEWOO",5,"NUBIRA",6,"SEDAN"]
[null,null,null,null,null,null,null,null,null,null,"URDANETA",null,null,null,null,null,null,null,null,null,null,null,null,null,null,null,null,null,null,null,null,"DAEWOO",5,"TACUMA",7,"MINI VAN"]
[null,null,null,null,null,null,null,null,null,null,"VENTANAS",null,null,null,null,null,null,null,null,null,null,null,null,null,null,null,null,null,null,null,null,"DAEWOO",5,"ESPERO",8,"SEDAN"]
[null,null,null,null,null,null,null,null,null,null,"VINCES",null,null,null,null,null,null,null,null,null,null,null,null,null,null,null,null,null,null,null,null,"DAEWOO",5,"RACER",9,"SEDAN"]
[null,null,null,null,null,null,null,null,null,null,"YAGUACHI",null,null,null,null,null,null,null,null,null,null,null,null,null,null,null,null,null,null,null,null,"DAEWOO",5,"CIELO",10,"SEDAN"]
[null,null,null,null,null,null,null,null,null,null,"ZAMORA",null,null,null,null,null,null,null,null,null,null,null,null,null,null,null,null,null,null,null,null,"DAEWOO",5,"COACH",11,"SEDAN"]
[null,null,null,null,null,null,null,null,null,null,"ZAPOTILLO",null,null,null,null,null,null,null,null,null,null,null,null,null,null,null,null,null,null,null,null,"DAEWOO",5,"DAMAS",12,"SEDAN"]
[null,null,null,null,null,null,null,null,null,null,"ZARUMA",null,null,null,null,null,null,null,null,null,null,null,null,null,null,null,null,null,null,null,null,"DAEWOO",5,"KORANDO",13,"JEEP"]
[null,null,null,null,null,null,null,null,null,null,null,null,null,null,null,null,null,null,null,null,null,null,null,null,null,null,null,null,null,null,null,"DAEWOO",5,"MUSSO",14,"JEEP"]
[null,null,null,null,null,null,null,null,null,null,null,null,null,null,null,null,null,null,null,null,null,null,null,null,null,null,null,null,null,null,null,"DAEWOO",5,"LEGANZA",15,"SEDAN"]
[null,null,null,null,null,null,null,null,null,null,null,null,null,null,null,null,null,null,null,null,null,null,null,null,null,null,null,null,null,null,null,"DAIHATSU",6,"TERIOS",1,"JEEP"]
[null,null,null,null,null,null,null,null,null,null,null,null,null,null,null,null,null,null,null,null,null,null,null,null,null,null,null,null,null,null,null,"DAIHATSU",6,"APLAUSSE",2,"SEDAN"]
[null,null,null,null,null,null,null,null,null,null,null,null,null,null,null,null,null,null,null,null,null,null,null,null,null,null,null,null,null,null,null,"DAIHATSU",6,"CHARADE",3,"SEDAN"]
[null,null,null,null,null,null,null,null,null,null,null,null,null,null,null,null,null,null,null,null,null,null,null,null,null,null,null,null,null,null,null,"DAIHATSU",6,"FEROZA",5,"JEEP"]
[null,null,null,null,null,null,null,null,null,null,null,null,null,null,null,null,null,null,null,null,null,null,null,null,null,null,null,null,null,null,null,"DAIHATSU",6,"GRAND MOVE",6,"SEDAN"]
[null,null,null,null,null,null,null,null,null,null,null,null,null,null,null,null,null,null,null,null,null,null,null,null,null,null,null,null,null,null,null,"DAIHATSU",6,"ROCKY",7,"JEEP"]
[null,null,null,null,null,null,null,null,null,null,null,null,null,null,null,null,null,null,null,null,null,null,null,null,null,null,null,null,null,null,null,"DAIHATSU",6,"A45 L",8,"SEDAN"]
[null,null,"DOCUMENTOS PERSONA NATURAL",null,null,null,null,null,null,null,null,null,null,null,null,null,null,null,null,null,null,null,null,null,null,null,null,null,null,null,null,"DAIHATSU",6,"COURE",9,"SEDAN"]
[null,null,"DOCUMENTOS PERSONA JURÍDICA",null,null,null,null,null,null,null,null,null,null,null,null,null,null,null,null,null,null,null,null,null,null,null,null,null,null,null,null,"DATSUN",30,1200,1,"PICK-UP"]
[null,null,null,null,null,null,null,null,null,null,null,null,null,null,null,null,null,null,null,null,null,null,null,null,null,null,null,null,null,null,null,"DATSUN",30,1500,2,"PICK-UP"]
[null,null,null,null,null,null,null,null,null,null,null,null,null,null,null,null,null,null,null,null,null,null,null,null,null,null,null,null,null,null,null,"DATSUN",30,1800,3,"PICK-UP"]
[null,null,null,null,null,null,null,null,null,null,null,null,null,null,null,null,null,null,null,null,null,null,null,null,null,null,null,null,null,null,null,"DATSUN",30,"120Y",4,"SEDAN"]
[null,null,null,null,null,null,null,null,null,null,null,null,null,null,null,null,null,null,null,null,null,null,null,null,null,null,null,null,null,null,null,"DATSUN",30,"160J",5,"SEDAN"]
[null,null,null,null,null,null," ",null,null,null,null,null,null,null,null,null,null,null,null,null,null,null,null,null,null,null,null,null,null,null,null,"DATSUN",30,"B 210",6,"COUPE"]
[null,null,null,null,null,null,null,null,null,null,null,null,null,null,null,null,null,null,null,null,null,null,null,null,null,null,null,null,null,null,null,"DATSUN",30,1000,7,"PICK-UP"]
[null,null,null,null,null,null,null,null,null,null,null,null,null,null,null,null,null,null,null,null,null,null,null,null,null,null,null,null,null,null,null,"DEER",111,"CC 1020 D",1,"PICK-UP"]
[null,null,null,null,null,null,null,null,null,null,null,null,null,null,null,null,null,null,null,null,null,null,null,null,null,null,null,null,null,null,null,"DODGE",31,"RAM 4X4",1,"PICK-UP"]
[null,null,null,null,null,null,null,null,null,null,null,null,null,null,null,null,null,null,null,null,null,null,null,null,null,null,null,null,null,null,null,"DODGE",31,"RAM 4X2",2,"PICK-UP"]
[null,null,null,null,null,null,null,null,null,null,null,null,null,null,null,null,null,null,null,null,null,null,null,null,null,null,null,null,null,null,null,"DODGE",31,"DAKOTA",3,"PICK-UP"]
[null,null,null,null,null,null,null,null,null,null,null,null,null,null,null,null,null,null,null,null,null,null,null,null,null,null,null,null,null,null,null,"DODGE",31,"DURANGO",4,"JEEP"]
[null,null,null,null,null,null,null,null,null,null,null,null,null,null,null,null,null,null,null,null,null,null,null,null,null,null,null,null,null,null,null,"DODGE",31,"ASPEN",5,"SEDAN"]
[null,null,null,null,null,null,null,null,null,null,null,null,null,null,null,null,null,null,null,null,null,null,null,null,null,null,null,null,null,null,null,"DODGE",31,"CARAVAN",7,"MINI VAN"]
[null,null,null,null,null,null,null,null,null,null,null,null,null,null,null,null,null,null,null,null,null,null,null,null,null,null,null,null,null,null,null,"FIAT",7,"UNO MILLE",1,"SEDAN"]
[null,null,null,null,null,null,null,null,null,null,null,null,null,null,null,null,null,null,null,null,null,null,null,null,null,null,null,null,null,null,null,"FIAT",7,"UNO",2,"COUPE"]
[null,null,null,null,null,null,null,null,null,null,null,null,null,null,null,null,null,null,null,null,null,null,null,null,null,null,null,null,null,null,null,"FIAT",7,"PREMIO",3,"SEDAN"]
[null,null,null,null,null,null,null,null,null,null,null,null,null,null,null,null,null,null,null,null,null,null,null,null,null,null,null,null,null,null,null,"FIAT",7,"FIORINO",4,"PICK-UP"]
[null,null,null,null,null,null,null,null,null,null,null,null,null,null,null,null,null,null,null,null,null,null,null,null,null,null,null,null,null,null,null,"FIAT",7,"PALIO",5,"SEDAN"]
[null,null,null,null,null,null,null,null,null,null,null,null,null,null,null,null,null,null,null,null,null,null,null,null,null,null,null,null,null,null,null,"FIAT",7,"POLSKY",6,"SEDAN"]
[null,null,null,null,null,null,null,null,null,null,null,null,null,null,null,null,null,null,null,null,null,null,null,null,null,null,null,null,null,null,null,"FIAT",7,"SPAZIO",7,"SEDAN"]
[null,null,null,null,null,null,null,null,null,null,null,null,null,null,null,null,null,null,null,null,null,null,null,null,null,null,null,null,null,null,null,"FIAT",7,"WEEKWEND",8,"SEDAN"]
[null,null,null,null,null,null,null,null,null,null,null,null,null,null,null,null,null,null,null,null,null,null,null,null,null,null,null,null,null,null,null,"FIAT",7,"CROMA",9,"SEDAN"]
[null,null,null,null,null,null,null,null,null,null,null,null,null,null,null,null,null,null,null,null,null,null,null,null,null,null,null,null,null,null,null,"FIAT",7,124,10,"COUPE"]
[null,null,null,null,null,null,null,null,null,null,null,null,null,null,null,null,null,null,null,null,null,null,null,null,null,null,null,null,null,null,null,"FIAT",7,132,11,"SEDAN"]
[null,null,null,null,null,null,null,null,null,null,null,null,null,null,null,null,null,null,null,null,null,null,null,null,null,null,null,null,null,null,null,"FIAT",7,"TIPO SX",13,"SEDAN"]
[null,null,null,null,null,null,null,null,null,null,null,null,null,null,null,null,null,null,null,null,null,null,null,null,null,null,null,null,null,null,null,"FIAT",7,"FLARESIDE",14,"SEDAN"]
[null,null,null,null,null,null,null,null,null,null,null,null,null,null,null,null,null,null,null,null,null,null,null,null,null,null,null,null,null,null,null,"FIAT",7,"SIENA",15,"SEDAN"]
[null,null,null,null,null,null,null,null,null,null,null,null,null,null,null,null,null,null,null,null,null,null,null,null,null,null,null,null,null,null,null,"FIAT",7,"STRADA",16,"PICK-UP"]
[null,null,null,null,null,null,null,null,null,null,null,null,null,null,null,null,null,null,null,null,null,null,null,null,null,null,null,null,null,null,null,"FIAT",7,"STILO CONFORT",17,"SEDAN"]
[null,null,null,null,null,null,null,null,null,null,null,null,null,null,null,null,null,null,null,null,null,null,null,null,null,null,null,null,null,null,null,"FIAT",7,"STILO",18,"SEDAN"]
[null,null,null,null,null,null,null,null,null,null,null,null,null,null,null,null,null,null,null,null,null,null,null,null,null,null,null,null,null,null,null,"FORD",8,"FESTIVA",1,"SEDAN"]
[null,null,null,null,null,null,null,null,null,null,null,null,null,null,null,null,null,null,null,null,null,null,null,null,null,null,null,null,null,null,null,"FORD",8,"ESCORT",2,"SEDAN"]
[null,null,null,null,null,null,null,null,null,null,null,null,null,null,null,null,null,null,null,null,null,null,null,null,null,null,null,null,null,null,null,"FORD",8,"COURIER",3,"PICK-UP"]
[null,null,null,null,null,null,null,null,null,null,null,null,null,null,null,null,null,null,null,null,null,null,null,null,null,null,null,null,null,null,null,"FORD",8,"RANGER 4X2",4,"PICK-UP"]
[null,null,null,null,null,null,null,null,null,null,null,null,null,null,null,null,null,null,null,null,null,null,null,null,null,null,null,null,null,null,null,"FORD",8,"RANGER 4X4",5,"PICK-UP"]
[null,null,null,null,null,null,null,null,null,null,null,null,null,null,null,null,null,null,null,null,null,null,null,null,null,null,null,null,null,null,null,"FORD",8,"RANGER CREW CAB 4X4",6,"PICK-UP"]
[null,null,null,null,null,null,null,null,null,null,null,null,null,null,null,null,null,null,null,null,null,null,null,null,null,null,null,null,null,null,null,"FORD",8,"F-150 XL 4X2",7,"PICK-UP"]
[null,null,null,null,null,null,null,null,null,null,null,null,null,null,null,null,null,null,null,null,null,null,null,null,null,null,null,null,null,null,null,"FORD",8,"F-150 XL 4X4",8,"PICK-UP"]
[null,null,null,null,null,null,null,null,null,null,null,null,null,null,null,null,null,null,null,null,null,null,null,null,null,null,null,null,null,null,null,"FORD",8,"F-150 LARIAT",9,"PICK-UP"]
[null,null,null,null,null,null,null,null,null,null,null,null,null,null,null,null,null,null,null,null,null,null,null,null,null,null,null,null,null,null,null,"FORD",8,"BRONCO",10,"JEEP"]
[null,null,null,null,null,null,null,null,null,null,null,null,null,null,null,null,null,null,null,null,null,null,null,null,null,null,null,null,null,null,null,"FORD",8,"EXPLORER 4X2 XL 3P",11,"JEEP"]
[null,null,null,null,null,null,null,null,null,null,null,null,null,null,null,null,null,null,null,null,null,null,null,null,null,null,null,null,null,null,null,"FORD",8,"EXPLORER 4X4 3P",12,"JEEP"]
[null,null,null,null,null,null,null,null,null,null,null,null,null,null,null,null,null,null,null,null,null,null,null,null,null,null,null,null,null,null,null,"FORD",8,"EXPLORER 4X4 5P",13,"JEEP"]
[null,null,null,null,null,null,null,null,null,null,null,null,null,null,null,null,null,null,null,null,null,null,null,null,null,null,null,null,null,null,null,"FORD",8,"EXPLORER 4X2 5P",14,"JEEP"]
[null,null,null,null,null,null,null,null,null,null,null,null,null,null,null,null,null,null,null,null,null,null,null,null,null,null,null,null,null,null,null,"FORD",8,"EXPEDITION EDDIE BAUER",15,"JEEP"]
[null,null,null,null,null,null,null,null,null,null,null,null,null,null,null,null,null,null,null,null,null,null,null,null,null,null,null,null,null,null,null,"FORD",8,"ESCAPE",16,"JEEP"]
[null,null,null,null,null,null,null,null,null,null,null,null,null,null,null,null,null,null,null,null,null,null,null,null,null,null,null,null,null,null,null,"FORD",8,"AEROSTAR",17,"MINI VAN"]
[null,null,null,null,null,null,null,null,null,null,null,null,null,null,null,null,null,null,null,null,null,null,null,null,null,null,null,null,null,null,null,"FORD",8,"CLUB WAGON",18,"MINI VAN"]
[null,null,null,null,null,null,null,null,null,null,null,null,null,null,null,null,null,null,null,null,null,null,null,null,null,null,null,null,null,null,null,"FORD",8,"CONTOUR",19,"SEDAN"]
[null,null,null,null,null,null,null,null,null,null,null,null,null,null,null,null,null,null,null,null,null,null,null,null,null,null,null,null,null,null,null,"FORD",8,"ECONOLINE",20,"MINI VAN"]
[null,null,null,null,null,null,null,null,null,null,null,null,null,null,null,null,null,null,null,null,null,null,null,null,null,null,null,null,null,null,null,"FORD",8,"F-250",21,"PICK-UP"]
[null,null,null,null,null,null,null,null,null,null,null,null,null,null,null,null,null,null,null,null,null,null,null,null,null,null,null,null,null,null,null,"FORD",8,"F-350",22,"PICK-UP"]
[null,null,null,null,null,null,null,null,null,null,null,null,null,null,null,null,null,null,null,null,null,null,null,null,null,null,null,null,null,null,null,"FORD",8,"F-470",23,"PICK-UP"]
[null,null,null,null,null,null,null,null,null,null,null,null,null,null,null,null,null,null,null,null,null,null,null,null,null,null,null,null,null,null,null,"FORD",8,"F-600",24,"PICK-UP"]
[null,null,null,null,null,null,null,null,null,null,null,null,null,null,null,null,null,null,null,null,null,null,null,null,null,null,null,null,null,null,null,"FORD",8,"F-700",25,"PICK-UP"]
[null,null,null,null,null,null,null,null,null,null,null,null,null,null,null,null,null,null,null,null,null,null,null,null,null,null,null,null,null,null,null,"FORD",8,"FIESTA",26,"COUPE"]
[null,null,null,null,null,null,null,null,null,null,null,null,null,null,null,null,null,null,null,null,null,null,null,null,null,null,null,null,null,null,null,"FORD",8,"MAVERICK",27,"SEDAN"]
[null,null,null,null,null,null,null,null,null,null,null,null,null,null,null,null,null,null,null,null,null,null,null,null,null,null,null,null,null,null,null,"FORD",8,"MONDEO",28,"SEDAN"]
[null,null,null,null,null,null,null,null,null,null,null,null,null,null,null,null,null,null,null,null,null,null,null,null,null,null,null,null,null,null,null,"FORD",8,"TAURUS",29,"SEDAN"]
[null,null,null,null,null,null,null,null,null,null,null,null,null,null,null,null,null,null,null,null,null,null,null,null,null,null,null,null,null,null,null,"FORD",8,"SIERRA",30,"PICK-UP"]
[null,null,null,null,null,null,null,null,null,null,null,null,null,null,null,null,null,null,null,null,null,null,null,null,null,null,null,null,null,null,null,"FORD",8,"SUPER DUTY",31,"MINI VAN"]
[null,null,null,null,null,null,null,null,null,null,null,null,null,null,null,null,null,null,null,null,null,null,null,null,null,null,null,null,null,null,null,"FORD",8,"TEMPO",32,"SEDAN"]
[null,null,null,null,null,null,null,null,null,null,null,null,null,null,null,null,null,null,null,null,null,null,null,null,null,null,null,null,null,null,null,"FORD",8,"WINDSTAR",33,"MINI VAN"]
[null,null,null,null,null,null,null,null,null,null,null,null,null,null,null,null,null,null,null,null,null,null,null,null,null,null,null,null,null,null,null,"FORD",8,"FUERTE",34,"JEEP"]
[null,null,null,null,null,null,null,null,null,null,null,null,null,null,null,null,null,null,null,null,null,null,null,null,null,null,null,null,null,null,null,"FORD",8,"F-100",35,"PICK-UP"]
[null,null,null,null,null,null,null,null,null,null,null,null,null,null,null,null,null,null,null,null,null,null,null,null,null,null,null,null,null,null,null,"FORD",8,"LASER",36,"SEDAN"]
[null,null,null,null,null,null,null,null,null,null,null,null,null,null,null,null,null,null,null,null,null,null,null,null,null,null,null,null,null,null,null,"FORD",8,"MUSTANG",38,"COUPE"]
[null,null,null,null,null,null,null,null,null,null,null,null,null,null,null,null,null,null,null,null,null,null,null,null,null,null,null,null,null,null,null,"FORD",8,"RANGER 4X2 D/C",40,"PICK-UP"]
[null,null,null,null,null,null,null,null,null,null,null,null,null,null,null,null,null,null,null,null,null,null,null,null,null,null,null,null,null,null,null,"FORD",8,"RANGER 4X4 D/C",41,"PICK-UP"]
[null,null,null,null,null,null,null,null,null,null,null,null,null,null,null,null,null,null,null,null,null,null,null,null,null,null,null,null,null,null,null,"FORD",8,"CUSTOM",42,"PICK-UP"]
[null,null,null,null,null,null,null,null,null,null,null,null,null,null,null,null,null,null,null,null,null,null,null,null,null,null,null,null,null,null,null,"FORD",8,"F-500",45,"PICK-UP"]
[null,null,null,null,null,null,null,null,null,null,null,null,null,null,null,null,null,null,null,null,null,null,null,null,null,null,null,null,null,null,null,"FORD",8,"F-650",46,"PICK-UP"]
[null,null,null,null,null,null,null,null,null,null,null,null,null,null,null,null,null,null,null,null,null,null,null,null,null,null,null,null,null,null,null,"FORD",8,"F-750",47,"PICK-UP"]
[null,null,null,null,null,null,null,null,null,null,null,null,null,null,null,null,null,null,null,null,null,null,null,null,null,null,null,null,null,null,null,"FORD",8,"FIESTA 4P",48,"SEDAN"]
[null,null,null,null,null,null,null,null,null,null,null,null,null,null,null,null,null,null,null,null,null,null,null,null,null,null,null,null,null,null,null,"FORD",8,"LTD",49,"SEDAN"]
[null,null,null,null,null,null,null,null,null,null,null,null,null,null,null,null,null,null,null,null,null,null,null,null,null,null,null,null,null,null,null,"FORD",8,"EXCURSION 4X4",50,"JEEP"]
[null,null,null,null,null,null,null,null,null,null,null,null,null,null,null,null,null,null,null,null,null,null,null,null,null,null,null,null,null,null,null,"FORD",8,"ECOSPORT 4X2",51,"JEEP"]
[null,null,null,null,null,null,null,null,null,null,null,null,null,null,null,null,null,null,null,null,null,null,null,null,null,null,null,null,null,null,null,"FORD",8,"ECOSPORT 4X4",52,"JEEP"]
[null,null,null,null,null,null,null,null,null,null,null,null,null,null,null,null,null,null,null,null,null,null,null,null,null,null,null,null,null,null,null,"FORD",8,"FOCUS",53,"SEDAN"]
[null,null,null,null,null,null,null,null,null,null,null,null,null,null,null,null,null,null,null,null,null,null,null,null,null,null,null,null,null,null,null,"FORD",8,"EXPLORER SPORT TRACK",54,"JEEP"]
[null,null,null,null,null,null,null,null,null,null,null,null,null,null,null,null,null,null,null,null,null,null,null,null,null,null,null,null,null,null,null,"FORD",8,"GRANADA",55,"SEDAN"]
[null,null,null,null,null,null,null,null,null,null,null,null,null,null,null,null,null,null,null,null,null,null,null,null,null,null,null,null,null,null,null,"FORD",8,"EXPLORER SPORT TRACK 4X2",56,"JEEP"]
[null,null,null,null,null,null,null,null,null,null,null,null,null,null,null,null,null,null,null,null,null,null,null,null,null,null,null,null,null,null,null,"FSO",77,"GLE 1600CC",1,"SEDAN"]
[null,null,null,null,null,null,null,null,null,null,null,null,null,null,null,null,null,null,null,null,null,null,null,null,null,null,null,null,null,null,null,"GMC",70,"SIERRA",1,"JEEP"]
[null,null,null,null,null,null,null,null,null,null,null,null,null,null,null,null,null,null,null,null,null,null,null,null,null,null,null,null,null,null,null,"GMC",70,"BLAZER",2,"JEEP"]
[null,null,null,null,null,null,null,null,null,null,null,null,null,null,null,null,null,null,null,null,null,null,null,null,null,null,null,null,null,null,null,"GMC",70,"SAFARY",3,"PICK-UP"]
[null,null,null,null,null,null,null,null,null,null,null,null,null,null,null,null,null,null,null,null,null,null,null,null,null,null,null,null,null,null,null,"GREAT WALL",108,"CC1020C C/S",1,"PICK-UP"]
[null,null,null,null,null,null,null,null,null,null,null,null,null,null,null,null,null,null,null,null,null,null,null,null,null,null,null,null,null,null,null,"GREAT WALL",108,"CC1020D",2,"PICK-UP"]
[null,null,null,null,null,null,null,null,null,null,null,null,null,null,null,null,null,null,null,null,null,null,null,null,null,null,null,null,null,null,null,"HONDA",9,"CRV 4X4",1,"JEEP"]
[null,null,null,null,null,null,null,null,null,null,null,null,null,null,null,null,null,null,null,null,null,null,null,null,null,null,null,null,null,null,null,"HONDA",9,"CIVIC",2,"SEDAN"]
[null,null,null,null,null,null,null,null,null,null,null,null,null,null,null,null,null,null,null,null,null,null,null,null,null,null,null,null,null,null,null,"HONDA",9,"ACCORD",3,"SEDAN"]
[null,null,null,null,null,null,null,null,null,null,null,null,null,null,null,null,null,null,null,null,null,null,null,null,null,null,null,null,null,null,null,"HONDA",9,"INTEGRA",6,"SEDAN"]
[null,null,null,null,null,null,null,null,null,null,null,null,null,null,null,null,null,null,null,null,null,null,null,null,null,null,null,null,null,null,null,"HONDA",9,"PRELUDE",7,"COUPE"]
[null,null,null,null,null,null,null,null,null,null,null,null,null,null,null,null,null,null,null,null,null,null,null,null,null,null,null,null,null,null,null,"HONDA",9,"ACURA",9,"SEDAN"]
[null,null,null,null,null,null,null,null,null,null,null,null,null,null,null,null,null,null,null,null,null,null,null,null,null,null,null,null,null,null,null,"HONDA",9,"ODYSSEY",11,"MINI VAN"]
[null,null,null,null,null,null,null,null,null,null,null,null,null,null,null,null,null,null,null,null,null,null,null,null,null,null,null,null,null,null,null,"HONDA",9,"CIVIC DEL SOL",14,"COUPE"]
[null,null,null,null,null,null,null,null,null,null,null,null,null,null,null,null,null,null,null,null,null,null,null,null,null,null,null,null,null,null,null,"HONDA",9,"FIT",17,"SEDAN"]
[null,null,null,null,null,null,null,null,null,null,null,null,null,null,null,null,null,null,null,null,null,null,null,null,null,null,null,null,null,null,null,"HONDA",9,"PILOT",20,"SEDAN"]
[null,null,null,null,null,null,null,null,null,null,null,null,null,null,null,null,null,null,null,null,null,null,null,null,null,null,null,null,null,null,null,"HONDA",9,"LEGEND",21,"SEDAN"]
[null,null,null,null,null,null,null,null,null,null,null,null,null,null,null,null,null,null,null,null,null,null,null,null,null,null,null,null,null,null,null,"HONDA",9,"CRV 4X2",28,"JEEP"]
[null,null,null,null,null,null,null,null,null,null,null,null,null,null,null,null,null,null,null,null,null,null,null,null,null,null,null,null,null,null,null,"HUMMER",115,"H2 UTILITY WAGON 4WD",1,"JEEP"]
[null,null,null,null,null,null,null,null,null,null,null,null,null,null,null,null,null,null,null,null,null,null,null,null,null,null,null,null,null,null,null,"HYUNDAI",10,"ACCENT",1,"SEDAN"]
[null,null,null,null,null,null,null,null,null,null,null,null,null,null,null,null,null,null,null,null,null,null,null,null,null,null,null,null,null,null,null,"HYUNDAI",10,"ACCENT VERNA",2,"SEDAN"]
[null,null,null,null,null,null,null,null,null,null,null,null,null,null,null,null,null,null,null,null,null,null,null,null,null,null,null,null,null,null,null,"HYUNDAI",10,"SANTA FE 4X4",3,"JEEP"]
[null,null,null,null,null,null,null,null,null,null,null,null,null,null,null,null,null,null,null,null,null,null,null,null,null,null,null,null,null,null,null,"HYUNDAI",10,"EXCEL 4P",4,"SEDAN"]
[null,null,null,null,null,null,null,null,null,null,null,null,null,null,null,null,null,null,null,null,null,null,null,null,null,null,null,null,null,null,null,"HYUNDAI",10,"EXCEL 5P",5,"SEDAN"]
[null,null,null,null,null,null,null,null,null,null,null,null,null,null,null,null,null,null,null,null,null,null,null,null,null,null,null,null,null,null,null,"HYUNDAI",10,"ELANTRA",6,"SEDAN"]
[null,null,null,null,null,null,null,null,null,null,null,null,null,null,null,null,null,null,null,null,null,null,null,null,null,null,null,null,null,null,null,"HYUNDAI",10,"ATOS",7,"SEDAN"]
[null,null,null,null,null,null,null,null,null,null,null,null,null,null,null,null,null,null,null,null,null,null,null,null,null,null,null,null,null,null,null,"HYUNDAI",10,"ATOS SEMIFULL",8,"SEDAN"]
[null,null,null,null,null,null,null,null,null,null,null,null,null,null,null,null,null,null,null,null,null,null,null,null,null,null,null,null,null,null,null,"HYUNDAI",10,"ELANTRA AVANTE",9,"SEDAN"]
[null,null,null,null,null,null,null,null,null,null,null,null,null,null,null,null,null,null,null,null,null,null,null,null,null,null,null,null,null,null,null,"HYUNDAI",10,"GALLOPER",10,"JEEP"]
[null,null,null,null,null,null,null,null,null,null,null,null,null,null,null,null,null,null,null,null,null,null,null,null,null,null,null,null,null,null,null,"HYUNDAI",10,"PONNY",14,"COUPE"]
[null,null,null,null,null,null,null,null,null,null,null,null,null,null,null,null,null,null,null,null,null,null,null,null,null,null,null,null,null,null,null,"HYUNDAI",10,"SCOUPE",15,"COUPE"]
[null,null,null,null,null,null,null,null,null,null,null,null,null,null,null,null,null,null,null,null,null,null,null,null,null,null,null,null,null,null,null,"HYUNDAI",10,"SONATA",16,"SEDAN"]
[null,null,null,null,null,null,null,null,null,null,null,null,null,null,null,null,null,null,null,null,null,null,null,null,null,null,null,null,null,null,null,"HYUNDAI",10,"GRAND SALOON",19,"SEDAN"]
[null,null,null,null,null,null,null,null,null,null,null,null,null,null,null,null,null,null,null,null,null,null,null,null,null,null,null,null,null,null,null,"HYUNDAI",10,"TERRACAN",20,"JEEP"]
[null,null,null,null,null,null,null,null,null,null,null,null,null,null,null,null,null,null,null,null,null,null,null,null,null,null,null,null,null,null,null,"HYUNDAI",10,"MATRIX",21,"MINI VAN"]
[null,null,null,null,null,null,null,null,null,null,null,null,null,null,null,null,null,null,null,null,null,null,null,null,null,null,null,null,null,null,null,"HYUNDAI",10,"SANTAMO",24,"SEDAN"]
[null,null,null,null,null,null,null,null,null,null,null,null,null,null,null,null,null,null,null,null,null,null,null,null,null,null,null,null,null,null,null,"HYUNDAI",10,"GETZ",25,"SEDAN"]
[null,null,null,null,null,null,null,null,null,null,null,null,null,null,null,null,null,null,null,null,null,null,null,null,null,null,null,null,null,null,null,"HYUNDAI",10,"TRAJET",26,"SEDAN"]
[null,null,null,null,null,null,null,null,null,null,null,null,null,null,null,null,null,null,null,null,null,null,null,null,null,null,null,null,null,null,null,"HYUNDAI",10,"HI",27,"SEDAN"]
[null,null,null,null,null,null,null,null,null,null,null,null,null,null,null,null,null,null,null,null,null,null,null,null,null,null,null,null,null,null,null,"HYUNDAI",10,"WINDOW VAN",28,"MINI VAN"]
[null,null,null,null,null,null,null,null,null,null,null,null,null,null,null,null,null,null,null,null,null,null,null,null,null,null,null,null,null,null,null,"HYUNDAI",10,"SANTA FE 4X2",29,"JEEP"]
[null,null,null,null,null,null,null,null,null,null,null,null,null,null,null,null,null,null,null,null,null,null,null,null,null,null,null,null,null,null,null,"HYUNDAI",10,"TUCSON",30,"JEEP"]
[null,null,null,null,null,null,null,null,null,null,null,null,null,null,null,null,null,null,null,null,null,null,null,null,null,null,null,null,null,null,null,"INTERNATIONAL",44,"SCOUT II",3,"JEEP"]
[null,null,null,null,null,null,null,null,null,null,null,null,null,null,null,null,null,null,null,null,null,null,null,null,null,null,null,null,null,null,null,"ISUZU",34,"NPR NLD",1,"PICK-UP"]
[null,null,null,null,null,null,null,null,null,null,null,null,null,null,null,null,null,null,null,null,null,null,null,null,null,null,null,null,null,null,null,"ISUZU",34,"RODEO",2,"JEEP"]
[null,null,null,null,null,null,null,null,null,null,null,null,null,null,null,null,null,null,null,null,null,null,null,null,null,null,null,null,null,null,null,"ISUZU",34,"TROOPER",3,"JEEP"]
[null,null,null,null,null,null,null,null,null,null,null,null,null,null,null,null,null,null,null,null,null,null,null,null,null,null,null,null,null,null,null,"JAGUAR",35,"J6",1,"SEDAN"]
[null,null,null,null,null,null,null,null,null,null,null,null,null,null,null,null,null,null,null,null,null,null,null,null,null,null,null,null,null,null,null,"JEEP",71,"WILLYS",1,"JEEP"]
[null,null,null,null,null,null,null,null,null,null,null,null,null,null,null,null,null,null,null,null,null,null,null,null,null,null,null,null,null,null,null,"JEEP",71,"WRANGLER",2,"JEEP"]
[null,null,null,null,null,null,null,null,null,null,null,null,null,null,null,null,null,null,null,null,null,null,null,null,null,null,null,null,null,null,null,"JEEP",71,"WRANGLER SAHARA",3,"JEEP"]
[null,null,null,null,null,null,null,null,null,null,null,null,null,null,null,null,null,null,null,null,null,null,null,null,null,null,null,null,null,null,null,"JEEP",71,"CHEROKEE RENEGADE",4,"JEEP"]
[null,null,null,null,null,null,null,null,null,null,null,null,null,null,null,null,null,null,null,null,null,null,null,null,null,null,null,null,null,null,null,"JEEP",71,"CHEROKEE",5,"JEEP"]
[null,null,null,null,null,null,null,null,null,null,null,null,null,null,null,null,null,null,null,null,null,null,null,null,null,null,null,null,null,null,null,"JEEP",71,"GRAND CHEROKEE",6,"JEEP"]
[null,null,null,null,null,null,null,null,null,null,null,null,null,null,null,null,null,null,null,null,null,null,null,null,null,null,null,null,null,null,null,"JEEP",71,"LIBERTY LIMITED",7,"JEEP"]
[null,null,null,null,null,null,null,null,null,null,null,null,null,null,null,null,null,null,null,null,null,null,null,null,null,null,null,null,null,null,null,"JEEP",71,"GRAND WAGONER",8,"JEEP"]
[null,null,null,null,null,null,null,null,null,null,null,null,null,null,null,null,null,null,null,null,null,null,null,null,null,null,null,null,null,null,null,"KIA",11,"SPORTAGE 4X4",1,"JEEP"]
[null,null,null,null,null,null,null,null,null,null,null,null,null,null,null,null,null,null,null,null,null,null,null,null,null,null,null,null,null,null,null,"KIA",11,"CARENS",2,"MINI VAN"]
[null,null,null,null,null,null,null,null,null,null,null,null,null,null,null,null,null,null,null,null,null,null,null,null,null,null,null,null,null,null,null,"KIA",11,"RIO 4P",3,"SEDAN"]
[null,null,null,null,null,null,null,null,null,null,null,null,null,null,null,null,null,null,null,null,null,null,null,null,null,null,null,null,null,null,null,"KIA",11,"CARNIVAL",4,"MINI VAN"]
[null,null,null,null,null,null,null,null,null,null,null,null,null,null,null,null,null,null,null,null,null,null,null,null,null,null,null,null,null,null,null,"KIA",11,"PRIDE POP",8,"COUPE"]
[null,null,null,null,null,null,null,null,null,null,null,null,null,null,null,null,null,null,null,null,null,null,null,null,null,null,null,null,null,null,null,"KIA",11,"SHEPIA",9,"SEDAN"]
[null,null,null,null,null,null,null,null,null,null,null,null,null,null,null,null,null,null,null,null,null,null,null,null,null,null,null,null,null,null,null,"KIA",11,"CERES 4X2",10,"PICK-UP"]
[null,null,null,null,null,null,null,null,null,null,null,null,null,null,null,null,null,null,null,null,null,null,null,null,null,null,null,null,null,null,null,"KIA",11,"K2700 C/S",11,"PICK-UP"]
[null,null,null,null,null,null,null,null,null,null,null,null,null,null,null,null,null,null,null,null,null,null,null,null,null,null,null,null,null,null,null,"KIA",11,"K2400 C/S",12,"PICK-UP"]
[null,null,null,null,null,null,null,null,null,null,null,null,null,null,null,null,null,null,null,null,null,null,null,null,null,null,null,null,null,null,null,"KIA",11,"K3600",13,"PICK-UP"]
[null,null,null,null,null,null,null,null,null,null,null,null,null,null,null,null,null,null,null,null,null,null,null,null,null,null,null,null,null,null,null,"KIA",11,"SPECTRA",14,"SEDAN"]
[null,null,null,null,null,null,null,null,null,null,null,null,null,null,null,null,null,null,null,null,null,null,null,null,null,null,null,null,null,null,null,"KIA",11,"SORENTO",17,"JEEP"]
[null,null,null,null,null,null,null,null,null,null,null,null,null,null,null,null,null,null,null,null,null,null,null,null,null,null,null,null,null,null,null,"KIA",11,"RIO STYLUS",18,"SEDAN"]
[null,null,null,null,null,null,null,null,null,null,null,null,null,null,null,null,null,null,null,null,null,null,null,null,null,null,null,null,null,null,null,"KIA",11,"PICANTO",19,"SEDAN"]
[null,null,null,null,null,null,null,null,null,null,null,null,null,null,null,null,null,null,null,null,null,null,null,null,null,null,null,null,null,null,null,"KIA",11,"CERATO",20,"SEDAN"]
[null,null,null,null,null,null,null,null,null,null,null,null,null,null,null,null,null,null,null,null,null,null,null,null,null,null,null,null,null,null,null,"LADA",13,2107,1,"SEDAN"]
[null,null,null,null,null,null,null,null,null,null,null,null,null,null,null,null,null,null,null,null,null,null,null,null,null,null,null,null,null,null,null,"LADA",13,"NIVA",2,"JEEP"]
[null,null,null,null,null,null,null,null,null,null,null,null,null,null,null,null,null,null,null,null,null,null,null,null,null,null,null,null,null,null,null,"LADA",13,2104,3,"SEDAN"]
[null,null,null,null,null,null,null,null,null,null,null,null,null,null,null,null,null,null,null,null,null,null,null,null,null,null,null,null,null,null,null,"LADA",13,2106,4,"SEDAN"]
[null,null,null,null,null,null,null,null,null,null,null,null,null,null,null,null,null,null,null,null,null,null,null,null,null,null,null,null,null,null,null,"LADA",13,2109,5,"SEDAN"]
[null,null,null,null,null,null,null,null,null,null,null,null,null,null,null,null,null,null,null,null,null,null,null,null,null,null,null,null,null,null,null,"LADA",13,1600,6,"SEDAN"]
[null,null,null,null,null,null,null,null,null,null,null,null,null,null,null,null,null,null,null,null,null,null,null,null,null,null,null,null,null,null,null,"LADA",13,2105,7,"SEDAN"]
[null,null,null,null,null,null,null,null,null,null,null,null,null,null,null,null,null,null,null,null,null,null,null,null,null,null,null,null,null,null,null,"LADA",13,2101,8,"SEDAN"]
[null,null,null,null,null,null,null,null,null,null,null,null,null,null,null,null,null,null,null,null,null,null,null,null,null,null,null,null,null,null,null,"LADA",13,"100 SEDAN",9,"SEDAN"]
[null,null,null,null,null,null,null,null,null,null,null,null,null,null,null,null,null,null,null,null,null,null,null,null,null,null,null,null,null,null,null,"LADA",13,2110,10,"SEDAN"]
[null,null,null,null,null,null,null,null,null,null,null,null,null,null,null,null,null,null,null,null,null,null,null,null,null,null,null,null,null,null,null,"LADA",13,110,11,"SEDAN"]
[null,null,null,null,null,null,null,null,null,null,null,null,null,null,null,null,null,null,null,null,null,null,null,null,null,null,null,null,null,null,null,"LADA",13,2112,12,"STATION WAGON"]
[null,null,null,null,null,null,null,null,null,null,null,null,null,null,null,null,null,null,null,null,null,null,null,null,null,null,null,null,null,null,null,"LADA",13,"100 STATION WAGON",13,"STATION WAGON"]
[null,null,null,null,null,null,null,null,null,null,null,null,null,null,null,null,null,null,null,null,null,null,null,null,null,null,null,null,null,null,null,"LADA",13,21102,14,"SEDAN"]
[null,null,null,null,null,null,null,null,null,null,null,null,null,null,null,null,null,null,null,null,null,null,null,null,null,null,null,null,null,null,null,"LADA",13,115,15,"SEDAN"]
[null,null,null,null,null,null,null,null,null,null,null,null,null,null,null,null,null,null,null,null,null,null,null,null,null,null,null,null,null,null,null,"LADA",13,21122,16,"SEDAN"]
[null,null,null,null,null,null,null,null,null,null,null,null,null,null,null,null,null,null,null,null,null,null,null,null,null,null,null,null,null,null,null,"LANCIA",36,"AUTOBIANCHI",1,"COUPE"]
[null,null,null,null,null,null,null,null,null,null,null,null,null,null,null,null,null,null,null,null,null,null,null,null,null,null,null,null,null,null,null,"LAND ROVER",12,"FREELANDER",1,"JEEP"]
[null,null,null,null,null,null,null,null,null,null,null,null,null,null,null,null,null,null,null,null,null,null,null,null,null,null,null,null,null,null,null,"LAND ROVER",12,"DISCOVERY",2,"JEEP"]
[null,null,null,null,null,null,null,null,null,null,null,null,null,null,null,null,null,null,null,null,null,null,null,null,null,null,null,null,null,null,null,"LAND ROVER",12,"RANGE ROVER",3,"JEEP"]
[null,null,null,null,null,null,null,null,null,null,null,null,null,null,null,null,null,null,null,null,null,null,null,null,null,null,null,null,null,null,null,"LAND ROVER",12,"ROVER 400",4,"JEEP"]
[null,null,null,null,null,null,null,null,null,null,null,null,null,null,null,null,null,null,null,null,null,null,null,null,null,null,null,null,null,null,null,"LAND ROVER",12,"DEFENDER",5,"JEEP"]
[null,null,null,null,null,null,null,null,null,null,null,null,null,null,null,null,null,null,null,null,null,null,null,null,null,null,null,null,null,null,null,"LAND ROVER",12,"VOGUE",6,"JEEP"]
[null,null,null,null,null,null,null,null,null,null,null,null,null,null,null,null,null,null,null,null,null,null,null,null,null,null,null,null,null,null,null,"LEXUS",37,"LX 470",1,"JEEP"]
[null,null,null,null,null,null,null,null,null,null,null,null,null,null,null,null,null,null,null,null,null,null,null,null,null,null,null,null,null,null,null,"LINCOLN",38,"NAVIGATOR",1,"JEEP"]
[null,null,null,null,null,null,null,null,null,null,null,null,null,null,null,null,null,null,null,null,null,null,null,null,null,null,null,null,null,null,null,"MAHINDRA",101,"SCORPIO LHD",1,"JEEP"]
[null,null,null,null,null,null,null,null,null,null,null,null,null,null,null,null,null,null,null,null,null,null,null,null,null,null,null,null,null,null,null,"MAZDA",14,"323 3P",1,"COUPE"]
[null,null,null,null,null,null,null,null,null,null,null,null,null,null,null,null,null,null,null,null,null,null,null,null,null,null,null,null,null,null,null,"MAZDA",14,"323 4P",2,"SEDAN"]
[null,null,null,null,null,null,null,null,null,null,null,null,null,null,null,null,null,null,null,null,null,null,null,null,null,null,null,null,null,null,null,"MAZDA",14,"323 5P",3,"STATION WAGON"]
[null,null,null,null,null,null,null,null,null,null,null,null,null,null,null,null,null,null,null,null,null,null,null,null,null,null,null,null,null,null,null,"MAZDA",14,"323 ALLEGRO 4P",4,"SEDAN"]
[null,null,null,null,null,null,null,null,null,null,null,null,null,null,null,null,null,null,null,null,null,null,null,null,null,null,null,null,null,null,null,"MAZDA",14,"323 ALLEGRO 5P",5,"STATION WAGON"]
[null,null,null,null,null,null,null,null,null,null,null,null,null,null,null,null,null,null,null,null,null,null,null,null,null,null,null,null,null,null,null,"MAZDA",14,626,6,"SEDAN"]
[null,null,null,null,null,null,null,null,null,null,null,null,null,null,null,null,null,null,null,null,null,null,null,null,null,null,null,null,null,null,null,"MAZDA",14,"B2200I C/S 4X2",7,"PICK-UP"]
[null,null,null,null,null,null,null,null,null,null,null,null,null,null,null,null,null,null,null,null,null,null,null,null,null,null,null,null,null,null,null,"MAZDA",14,"B2200I D/C 4X2",8,"PICK-UP"]
[null,null,null,null,null,null,null,null,null,null,null,null,null,null,null,null,null,null,null,null,null,null,null,null,null,null,null,null,null,null,null,"MAZDA",14,"B2600I C/S 4X4",9,"PICK-UP"]
[null,null,null,null,null,null,null,null,null,null,null,null,null,null,null,null,null,null,null,null,null,null,null,null,null,null,null,null,null,null,null,"MAZDA",14,"B2600I D/C 4X4",10,"PICK-UP"]
[null,null,null,null,null,null,null,null,null,null,null,null,null,null,null,null,null,null,null,null,null,null,null,null,null,null,null,null,null,null,null,"MAZDA",14,"B2000 C/S 4X2",11,"PICK-UP"]
[null,null,null,null,null,null,null,null,null,null,null,null,null,null,null,null,null,null,null,null,null,null,null,null,null,null,null,null,null,null,null,"MAZDA",14,"B2000 D/C 4X2",12,"PICK-UP"]
[null,null,null,null,null,null,null,null,null,null,null,null,null,null,null,null,null,null,null,null,null,null,null,null,null,null,null,null,null,null,null,"MAZDA",14,"PROTEGE",13,"COUPE"]
[null,null,null,null,null,null,null,null,null,null,null,null,null,null,null,null,null,null,null,null,null,null,null,null,null,null,null,null,null,null,null,"MAZDA",14,"MATSURI",14,"SEDAN"]
[null,null,null,null,null,null,null,null,null,null,null,null,null,null,null,null,null,null,null,null,null,null,null,null,null,null,null,null,null,null,null,"MAZDA",14,"MX3",15,"COUPE"]
[null,null,null,null,null,null,null,null,null,null,null,null,null,null,null,null,null,null,null,null,null,null,null,null,null,null,null,null,null,null,null,"MAZDA",14,"MPV VAN",16,"MINI VAN"]
[null,null,null,null,null,null,null,null,null,null,null,null,null,null,null,null,null,null,null,null,null,null,null,null,null,null,null,null,null,null,null,"MAZDA",14,"B2500 C/S",17,"PICK-UP"]
[null,null,null,null,null,null,null,null,null,null,null,null,null,null,null,null,null,null,null,null,null,null,null,null,null,null,null,null,null,null,null,"MAZDA",14,"B2500 C/D",18,"PICK-UP"]
[null,null,null,null,null,null,null,null,null,null,null,null,null,null,null,null,null,null,null,null,null,null,null,null,null,null,null,null,null,null,null,"MAZDA",14,"TRIBUTE AT SDX",20,"JEEP"]
[null,null,null,null,null,null,null,null,null,null,null,null,null,null,null,null,null,null,null,null,null,null,null,null,null,null,null,null,null,null,null,"MAZDA",14,"CIAO TEMPO 1.3 CC",21,"SEDAN"]
[null,null,null,null,null,null,null,null,null,null,null,null,null,null,null,null,null,null,null,null,null,null,null,null,null,null,null,null,null,null,null,"MAZDA",14,929,22,"SEDAN"]
[null,null,null,null,null,null,null,null,null,null,null,null,null,null,null,null,null,null,null,null,null,null,null,null,null,null,null,null,null,null,null,"MAZDA",14,"B29DCP",23,"PICK-UP"]
[null,null,null,null,null,null,null,null,null,null,null,null,null,null,null,null,null,null,null,null,null,null,null,null,null,null,null,null,null,null,null,"MAZDA",14,"MIATA MX5",24,"COUPE"]
[null,null,null,null,null,null,null,null,null,null,null,null,null,null,null,null,null,null,null,null,null,null,null,null,null,null,null,null,null,null,null,"MAZDA",14,"6 2.0",25,"SEDAN"]
[null,null,null,null,null,null,null,null,null,null,null,null,null,null,null,null,null,null,null,null,null,null,null,null,null,null,null,null,null,null,null,"MAZDA",14,"RX8",26,"COUPE"]
[null,null,null,null,null,null,null,null,null,null,null,null,null,null,null,null,null,null,null,null,null,null,null,null,null,null,null,null,null,null,null,"MERCEDES BENZ",15,"190E",1,"SEDAN"]
[null,null,null,null,null,null,null,null,null,null,null,null,null,null,null,null,null,null,null,null,null,null,null,null,null,null,null,null,null,null,null,"MERCEDES BENZ",15,"A160 CLASSIC",2,"SEDAN"]
[null,null,null,null,null,null,null,null,null,null,null,null,null,null,null,null,null,null,null,null,null,null,null,null,null,null,null,null,null,null,null,"MERCEDES BENZ",15,"C200 KOMPRESOR",3,"SEDAN"]
[null,null,null,null,null,null,null,null,null,null,null,null,null,null,null,null,null,null,null,null,null,null,null,null,null,null,null,null,null,null,null,"MERCEDES BENZ",15,"C240",4,"SEDAN"]
[null,null,null,null,null,null,null,null,null,null,null,null,null,null,null,null,null,null,null,null,null,null,null,null,null,null,null,null,null,null,null,"MERCEDES BENZ",15,"C320",5,"SEDAN"]
[null,null,null,null,null,null,null,null,null,null,null,null,null,null,null,null,null,null,null,null,null,null,null,null,null,null,null,null,null,null,null,"MERCEDES BENZ",15,"E320",6,"SEDAN"]
[null,null,null,null,null,null,null,null,null,null,null,null,null,null,null,null,null,null,null,null,null,null,null,null,null,null,null,null,null,null,null,"MERCEDES BENZ",15,"ML 320 (4X4)",7,"JEEP"]
[null,null,null,null,null,null,null,null,null,null,null,null,null,null,null,null,null,null,null,null,null,null,null,null,null,null,null,null,null,null,null,"MERCEDES BENZ",15,"ML 430 (4X4)",8,"JEEP"]
[null,null,null,null,null,null,null,null,null,null,null,null,null,null,null,null,null,null,null,null,null,null,null,null,null,null,null,null,null,null,null,"MERCEDES BENZ",15,"C230 KOMPRESOR",9,"SEDAN"]
[null,null,null,null,null,null,null,null,null,null,null,null,null,null,null,null,null,null,null,null,null,null,null,null,null,null,null,null,null,null,null,"MERCEDES BENZ",15,260,10,"SEDAN"]
[null,null,null,null,null,null,null,null,null,null,null,null,null,null,null,null,null,null,null,null,null,null,null,null,null,null,null,null,null,null,null,"MERCEDES BENZ",15,"SERIE G (4X4) 5P.",11,"SEDAN"]
[null,null,null,null,null,null,null,null,null,null,null,null,null,null,null,null,null,null,null,null,null,null,null,null,null,null,null,null,null,null,null,"MERCEDES BENZ",15,"C280 - 280",12,"SEDAN"]
[null,null,null,null,null,null,null,null,null,null,null,null,null,null,null,null,null,null,null,null,null,null,null,null,null,null,null,null,null,null,null,"MERCEDES BENZ",15,"200E",13,"SEDAN"]
[null,null,null,null,null,null,null,null,null,null,null,null,null,null,null,null,null,null,null,null,null,null,null,null,null,null,null,null,null,null,null,"MERCEDES BENZ",15,"280E",14,"SEDAN"]
[null,null,null,null,null,null,null,null,null,null,null,null,null,null,null,null,null,null,null,null,null,null,null,null,null,null,null,null,null,null,null,"MERCEDES BENZ",15,"250E",15,"SEDAN"]
[null,null,null,null,null,null,null,null,null,null,null,null,null,null,null,null,null,null,null,null,null,null,null,null,null,null,null,null,null,null,null,"MERCEDES BENZ",15,"260E",16,"SEDAN"]
[null,null,null,null,null,null,null,null,null,null,null,null,null,null,null,null,null,null,null,null,null,null,null,null,null,null,null,null,null,null,null,"MERCEDES BENZ",15,"300E",17,"SEDAN"]
[null,null,null,null,null,null,null,null,null,null,null,null,null,null,null,null,null,null,null,null,null,null,null,null,null,null,null,null,null,null,null,"MERCEDES BENZ",15,"C220",18,"SEDAN"]
[null,null,null,null,null,null,null,null,null,null,null,null,null,null,null,null,null,null,null,null,null,null,null,null,null,null,null,null,null,null,null,"MERCEDES BENZ",15,430,19,"SEDAN"]
[null,null,null,null,null,null,null,null,null,null,null,null,null,null,null,null,null,null,null,null,null,null,null,null,null,null,null,null,null,null,null,"MERCEDES BENZ",15,"230 F",20,"SEDAN"]
[null,null,null,null,null,null,null,null,null,null,null,null,null,null,null,null,null,null,null,null,null,null,null,null,null,null,null,null,null,null,null,"MERCEDES BENZ",15,"300SE",21,"SEDAN"]
[null,null,null,null,null,null,null,null,null,null,null,null,null,null,null,null,null,null,null,null,null,null,null,null,null,null,null,null,null,null,null,"MERCEDES BENZ",15,"C200",22,"SEDAN"]
[null,null,null,null,null,null,null,null,null,null,null,null,null,null,null,null,null,null,null,null,null,null,null,null,null,null,null,null,null,null,null,"MERCEDES BENZ",15,"SLK 230",23,"COUPE"]
[null,null,null,null,null,null,null,null,null,null,null,null,null,null,null,null,null,null,null,null,null,null,null,null,null,null,null,null,null,null,null,"MERCEDES BENZ",15,"C230",24,"SEDAN"]
[null,null,null,null,null,null,null,null,null,null,null,null,null,null,null,null,null,null,null,null,null,null,null,null,null,null,null,null,null,null,null,"MERCEDES BENZ",15,220,25,"SEDAN"]
[null,null,null,null,null,null,null,null,null,null,null,null,null,null,null,null,null,null,null,null,null,null,null,null,null,null,null,null,null,null,null,"MERCEDES BENZ",15,"230E",26,"SEDAN"]
[null,null,null,null,null,null,null,null,null,null,null,null,null,null,null,null,null,null,null,null,null,null,null,null,null,null,null,null,null,null,null,"MERCEDES BENZ",15,"500SEL",28,"SEDAN"]
[null,null,null,null,null,null,null,null,null,null,null,null,null,null,null,null,null,null,null,null,null,null,null,null,null,null,null,null,null,null,null,"MERCEDES BENZ",15,"240E",29,"SEDAN"]
[null,null,null,null,null,null,null,null,null,null,null,null,null,null,null,null,null,null,null,null,null,null,null,null,null,null,null,null,null,null,null,"MERCEDES BENZ",15,"ML 500",30,"SEDAN"]
[null,null,null,null,null,null,null,null,null,null,null,null,null,null,null,null,null,null,null,null,null,null,null,null,null,null,null,null,null,null,null,"MERCEDES BENZ",15,"C230K",31,"SEDAN"]
[null,null,null,null,null,null,null,null,null,null,null,null,null,null,null,null,null,null,null,null,null,null,null,null,null,null,null,null,null,null,null,"MERCEDES BENZ",15,"ML230",32,"JEEP"]
[null,null,null,null,null,null,null,null,null,null,null,null,null,null,null,null,null,null,null,null,null,null,null,null,null,null,null,null,null,null,null,"MERCEDES BENZ",15,"C180",35,"SEDAN"]
[null,null,null,null,null,null,null,null,null,null,null,null,null,null,null,null,null,null,null,null,null,null,null,null,null,null,null,null,null,null,null,"MERCEDES BENZ",15,"ML 350",37,"JEEP"]
[null,null,null,null,null,null,null,null,null,null,null,null,null,null,null,null,null,null,null,null,null,null,null,null,null,null,null,null,null,null,null,"MERCEDES BENZ",15,"CLK320",38,"SEDAN"]
[null,null,null,null,null,null,null,null,null,null,null,null,null,null,null,null,null,null,null,null,null,null,null,null,null,null,null,null,null,null,null,"MITSUBISHI",16,"L-200 4X2 C/S",1,"PICK-UP"]
[null,null,null,null,null,null,null,null,null,null,null,null,null,null,null,null,null,null,null,null,null,null,null,null,null,null,null,null,null,null,null,"MITSUBISHI",16,"L-200 4X2 D/C",2,"PICK-UP"]
[null,null,null,null,null,null,null,null,null,null,null,null,null,null,null,null,null,null,null,null,null,null,null,null,null,null,null,null,null,null,null,"MITSUBISHI",16,"L-200 4X4 C/S",3,"PICK-UP"]
[null,null,null,null,null,null,null,null,null,null,null,null,null,null,null,null,null,null,null,null,null,null,null,null,null,null,null,null,null,null,null,"MITSUBISHI",16,"L-200 4X4 D/C",4,"PICK-UP"]
[null,null,null,null,null,null,null,null,null,null,null,null,null,null,null,null,null,null,null,null,null,null,null,null,null,null,null,null,null,null,null,"MITSUBISHI",16,"LANCER",5,"SEDAN"]
[null,null,null,null,null,null,null,null,null,null,null,null,null,null,null,null,null,null,null,null,null,null,null,null,null,null,null,null,null,null,null,"MITSUBISHI",16,"SPACE WAGON 5P",6,"MINI VAN"]
[null,null,null,null,null,null,null,null,null,null,null,null,null,null,null,null,null,null,null,null,null,null,null,null,null,null,null,null,null,null,null,"MITSUBISHI",16,"MONTERO 3P",7,"JEEP"]
[null,null,null,null,null,null,null,null,null,null,null,null,null,null,null,null,null,null,null,null,null,null,null,null,null,null,null,null,null,null,null,"MITSUBISHI",16,"MONTERO 5P",8,"JEEP"]
[null,null,null,null,null,null,null,null,null,null,null,null,null,null,null,null,null,null,null,null,null,null,null,null,null,null,null,null,null,null,null,"MITSUBISHI",16,"MONTERO SPORT",9,"JEEP"]
[null,null,null,null,null,null,null,null,null,null,null,null,null,null,null,null,null,null,null,null,null,null,null,null,null,null,null,null,null,null,null,"MITSUBISHI",16,"GALANT",11,"SEDAN"]
[null,null,null,null,null,null,null,null,null,null,null,null,null,null,null,null,null,null,null,null,null,null,null,null,null,null,null,null,null,null,null,"MITSUBISHI",16,"ECLIPSE SPYDER",12,"COUPE"]
[null,null,null,null,null,null,null,null,null,null,null,null,null,null,null,null,null,null,null,null,null,null,null,null,null,null,null,null,null,null,null,"MITSUBISHI",16,"L300 C/D",14,"PICK-UP"]
[null,null,null,null,null,null,null,null,null,null,null,null,null,null,null,null,null,null,null,null,null,null,null,null,null,null,null,null,null,null,null,"MITSUBISHI",16,"L400 C/S",15,"PICK-UP"]
[null,null,null,null,null,null,null,null,null,null,null,null,null,null,null,null,null,null,null,null,null,null,null,null,null,null,null,null,null,null,null,"MITSUBISHI",16,"L400 D/C",16,"PICK-UP"]
[null,null,null,null,null,null,null,null,null,null,null,null,null,null,null,null,null,null,null,null,null,null,null,null,null,null,null,null,null,null,null,"MITSUBISHI",16,"MONTERO IO",17,"JEEP"]
[null,null,null,null,null,null,null,null,null,null,null,null,null,null,null,null,null,null,null,null,null,null,null,null,null,null,null,null,null,null,null,"MITSUBISHI",16,"OUTLANDER",18,"MINI VAN"]
[null,null,null,null,null,null,null,null,null,null,null,null,null,null,null,null,null,null,null,null,null,null,null,null,null,null,null,null,null,null,null,"NISSAN",17,"1200 P/U",1,"PICK-UP"]
[null,null,null,null,null,null,null,null,null,null,null,null,null,null,null,null,null,null,null,null,null,null,null,null,null,null,null,null,null,null,null,"NISSAN",17,"2400 C/S 4X2",2,"PICK-UP"]
[null,null,null,null,null,null,null,null,null,null,null,null,null,null,null,null,null,null,null,null,null,null,null,null,null,null,null,null,null,null,null,"NISSAN",17,"2400 D/C 4X2",3,"PICK-UP"]
[null,null,null,null,null,null,null,null,null,null,null,null,null,null,null,null,null,null,null,null,null,null,null,null,null,null,null,null,null,null,null,"NISSAN",17,"2400 D/C 4X4",4,"PICK-UP"]
[null,null,null,null,null,null,null,null,null,null,null,null,null,null,null,null,null,null,null,null,null,null,null,null,null,null,null,null,null,null,null,"NISSAN",17,"PATHFINDER",5,"JEEP"]
[null,null,null,null,null,null,null,null,null,null,null,null,null,null,null,null,null,null,null,null,null,null,null,null,null,null,null,null,null,null,null,"NISSAN",17,"PATHFINDER FULL",6,"JEEP"]
[null,null,null,null,null,null,null,null,null,null,null,null,null,null,null,null,null,null,null,null,null,null,null,null,null,null,null,null,null,null,null,"NISSAN",17,"PATROL 3P",7,"JEEP"]
[null,null,null,null,null,null,null,null,null,null,null,null,null,null,null,null,null,null,null,null,null,null,null,null,null,null,null,null,null,null,null,"NISSAN",17,"PATROL 5P",8,"JEEP"]
[null,null,null,null,null,null,null,null,null,null,null,null,null,null,null,null,null,null,null,null,null,null,null,null,null,null,null,null,null,null,null,"NISSAN",17,"SENTRA I",9,"SEDAN"]
[null,null,null,null,null,null,null,null,null,null,null,null,null,null,null,null,null,null,null,null,null,null,null,null,null,null,null,null,null,null,null,"NISSAN",17,"SENTRA II",10,"SEDAN"]
[null,null,null,null,null,null,null,null,null,null,null,null,null,null,null,null,null,null,null,null,null,null,null,null,null,null,null,null,null,null,null,"NISSAN",17,"ALMERA",11,"SEDAN"]
[null,null,null,null,null,null,null,null,null,null,null,null,null,null,null,null,null,null,null,null,null,null,null,null,null,null,null,null,null,null,null,"NISSAN",17,"ALTIMA",12,"SEDAN"]
[null,null,null,null,null,null,null,null,null,null,null,null,null,null,null,null,null,null,null,null,null,null,null,null,null,null,null,null,null,null,null,"NISSAN",17,"BLUEBIRD",14,"SEDAN"]
[null,null,null,null,null,null,null,null,null,null,null,null,null,null,null,null,null,null,null,null,null,null,null,null,null,null,null,null,null,null,null,"NISSAN",17,"INFINITY",19,"SEDAN"]
[null,null,null,null,null,null,null,null,null,null,null,null,null,null,null,null,null,null,null,null,null,null,null,null,null,null,null,null,null,null,null,"NISSAN",17,"LB120",21,"PICK-UP"]
[null,null,null,null,null,null,null,null,null,null,null,null,null,null,null,null,null,null,null,null,null,null,null,null,null,null,null,null,null,null,null,"NISSAN",17,"MAXIMA",22,"SEDAN"]
[null,null,null,null,null,null,null,null,null,null,null,null,null,null,null,null,null,null,null,null,null,null,null,null,null,null,null,null,null,null,null,"NISSAN",17,"PRIMERA",23,"SEDAN"]
[null,null,null,null,null,null,null,null,null,null,null,null,null,null,null,null,null,null,null,null,null,null,null,null,null,null,null,null,null,null,null,"NISSAN",17,"QUEST",24,"MINI VAN"]
[null,null,null,null,null,null,null,null,null,null,null,null,null,null,null,null,null,null,null,null,null,null,null,null,null,null,null,null,null,null,null,"NISSAN",17,"SUNNY",25,"SEDAN"]
[null,null,null,null,null,null,null,null,null,null,null,null,null,null,null,null,null,null,null,null,null,null,null,null,null,null,null,null,null,null,null,"NISSAN",17,"1800 C/S",27,"PICK-UP"]
[null,null,null,null,null,null,null,null,null,null,null,null,null,null,null,null,null,null,null,null,null,null,null,null,null,null,null,null,null,null,null,"NISSAN",17,"1800 D/C",28,"PICK-UP"]
[null,null,null,null,null,null,null,null,null,null,null,null,null,null,null,null,null,null,null,null,null,null,null,null,null,null,null,null,null,null,null,"NISSAN",17,"TERRANO",29,"JEEP"]
[null,null,null,null,null,null,null,null,null,null,null,null,null,null,null,null,null,null,null,null,null,null,null,null,null,null,null,null,null,null,null,"NISSAN",17,"X.TRAIL",30,"JEEP"]
[null,null,null,null,null,null,null,null,null,null,null,null,null,null,null,null,null,null,null,null,null,null,null,null,null,null,null,null,null,null,null,"NISSAN",17,"SENTRA SWA",31,"STATION WAGON"]
[null,null,null,null,null,null,null,null,null,null,null,null,null,null,null,null,null,null,null,null,null,null,null,null,null,null,null,null,null,null,null,"NISSAN",17,"2000 C/S",32,"PICK-UP"]
[null,null,null,null,null,null,null,null,null,null,null,null,null,null,null,null,null,null,null,null,null,null,null,null,null,null,null,null,null,null,null,"NISSAN",17,"PICKUP 4X2 D/C",33,"PICK-UP"]
[null,null,null,null,null,null,null,null,null,null,null,null,null,null,null,null,null,null,null,null,null,null,null,null,null,null,null,null,null,null,null,"NISSAN",17,"FRONTIER C/D 4X4",34,"PICK-UP"]
[null,null,null,null,null,null,null,null,null,null,null,null,null,null,null,null,null,null,null,null,null,null,null,null,null,null,null,null,null,null,null,"NISSAN",17,"MURANO",36,"JEEP"]
[null,null,null,null,null,null,null,null,null,null,null,null,null,null,null,null,null,null,null,null,null,null,null,null,null,null,null,null,null,null,null,"NISSAN",17,"FRONTIER C/D 4X2",37,"PICK-UP"]
[null,null,null,null,null,null,null,null,null,null,null,null,null,null,null,null,null,null,null,null,null,null,null,null,null,null,null,null,null,null,null,"NISSAN",17,"CLD 211 S",38,"PICK-UP"]
[null,null,null,null,null,null,null,null,null,null,null,null,null,null,null,null,null,null,null,null,null,null,null,null,null,null,null,null,null,null,null,"NISSAN",17,"PICKUP 4X2 C/S",39,"PICK-UP"]
[null,null,null,null,null,null,null,null,null,null,null,null,null,null,null,null,null,null,null,null,null,null,null,null,null,null,null,null,null,null,null,"OLDSMOBIL",73,"SILHOUETTE",1,"SEDAN"]
[null,null,null,null,null,null,null,null,null,null,null,null,null,null,null,null,null,null,null,null,null,null,null,null,null,null,null,null,null,null,null,"OLTCIT",40,"CLUB 12TRS",1,"SEDAN"]
[null,null,null,null,null,null,null,null,null,null,null,null,null,null,null,null,null,null,null,null,null,null,null,null,null,null,null,null,null,null,null,"PEUGEOT",18,"306 5P",1,"SEDAN"]
[null,null,null,null,null,null,null,null,null,null,null,null,null,null,null,null,null,null,null,null,null,null,null,null,null,null,null,null,null,null,null,"PEUGEOT",18,"206 3P",2,"COUPE"]
[null,null,null,null,null,null,null,null,null,null,null,null,null,null,null,null,null,null,null,null,null,null,null,null,null,null,null,null,null,null,null,"PEUGEOT",18,"206 5P",3,"SEDAN"]
[null,null,null,null,null,null,null,null,null,null,null,null,null,null,null,null,null,null,null,null,null,null,null,null,null,null,null,null,null,null,null,"PEUGEOT",18,"406 4P",4,"SEDAN"]
[null,null,null,null,null,null,null,null,null,null,null,null,null,null,null,null,null,null,null,null,null,null,null,null,null,null,null,null,null,null,null,"PEUGEOT",18,405,5,"SEDAN"]
[null,null,null,null,null,null,null,null,null,null,null,null,null,null,null,null,null,null,null,null,null,null,null,null,null,null,null,null,null,null,null,"PEUGEOT",18,305,6,"SEDAN"]
[null,null,null,null,null,null,null,null,null,null,null,null,null,null,null,null,null,null,null,null,null,null,null,null,null,null,null,null,null,null,null,"PEUGEOT",18,504,7,"SEDAN"]
[null,null,null,null,null,null,null,null,null,null,null,null,null,null,null,null,null,null,null,null,null,null,null,null,null,null,null,null,null,null,null,"PEUGEOT",18,505,8,"SEDAN"]
[null,null,null,null,null,null,null,null,null,null,null,null,null,null,null,null,null,null,null,null,null,null,null,null,null,null,null,null,null,null,null,"PEUGEOT",18,604,9,"SEDAN"]
[null,null,null,null,null,null,null,null,null,null,null,null,null,null,null,null,null,null,null,null,null,null,null,null,null,null,null,null,null,null,null,"PEUGEOT",18,605,10,"SEDAN"]
[null,null,null,null,null,null,null,null,null,null,null,null,null,null,null,null,null,null,null,null,null,null,null,null,null,null,null,null,null,null,null,"PEUGEOT",18,806,11,"SEDAN"]
[null,null,null,null,null,null,null,null,null,null,null,null,null,null,null,null,null,null,null,null,null,null,null,null,null,null,null,null,null,null,null,"PEUGEOT",18,"BERLINA",12,"SEDAN"]
[null,null,null,null,null,null,null,null,null,null,null,null,null,null,null,null,null,null,null,null,null,null,null,null,null,null,null,null,null,null,null,"PEUGEOT",18,404,13,"PICK-UP"]
[null,null,null,null,null,null,null,null,null,null,null,null,null,null,null,null,null,null,null,null,null,null,null,null,null,null,null,null,null,null,null,"PEUGEOT",18,"106 XR",14,"SEDAN"]
[null,null,null,null,null,null,null,null,null,null,null,null,null,null,null,null,null,null,null,null,null,null,null,null,null,null,null,null,null,null,null,"PEUGEOT",18,"BREAK",15,"SEDAN"]
[null,null,null,null,null,null,null,null,null,null,null,null,null,null,null,null,null,null,null,null,null,null,null,null,null,null,null,null,null,null,null,"PEUGEOT",18,1600,16,"PICK-UP"]
[null,null,null,null,null,null,null,null,null,null,null,null,null,null,null,null,null,null,null,null,null,null,null,null,null,null,null,null,null,null,null,"PEUGEOT",18,"BREAK 307",17,"SEDAN"]
[null,null,null,null,null,null,null,null,null,null,null,null,null,null,null,null,null,null,null,null,null,null,null,null,null,null,null,null,null,null,null,"PEUGEOT",18,"S16 3P",18,"COUPE"]
[null,null,null,null,null,null,null,null,null,null,null,null,null,null,null,null,null,null,null,null,null,null,null,null,null,null,null,null,null,null,null,"PEUGEOT",18,307,19,"SEDAN"]
[null,null,null,null,null,null,null,null,null,null,null,null,null,null,null,null,null,null,null,null,null,null,null,null,null,null,null,null,null,null,null,"PEUGEOT",18,"807 ST 2.0 AT",20,"SEDAN"]
[null,null,null,null,null,null,null,null,null,null,null,null,null,null,null,null,null,null,null,null,null,null,null,null,null,null,null,null,null,null,null,"PLYMOUTH",54,"VOYAGER",1,"MINI VAN"]
[null,null,null,null,null,null,null,null,null,null,null,null,null,null,null,null,null,null,null,null,null,null,null,null,null,null,null,null,null,null,null,"PLYMOUTH",54,"GRAND VOYAGER",3,"MINI VAN"]
[null,null,null,null,null,null,null,null,null,null,null,null,null,null,null,null,null,null,null,null,null,null,null,null,null,null,null,null,null,null,null,"PORCHE",56,"BOXSTER 986",1,"COUPE"]
[null,null,null,null,null,null,null,null,null,null,null,null,null,null,null,null,null,null,null,null,null,null,null,null,null,null,null,null,null,null,null,"PORCHE",56,"CAYENNE",2,"JEEP"]
[null,null,null,null,null,null,null,null,null,null,null,null,null,null,null,null,null,null,null,null,null,null,null,null,null,null,null,null,null,null,null,"RENAULT",19,"TWINGO",1,"COUPE"]
[null,null,null,null,null,null,null,null,null,null,null,null,null,null,null,null,null,null,null,null,null,null,null,null,null,null,null,null,null,null,null,"RENAULT",19,"CLIO",2,"SEDAN"]
[null,null,null,null,null,null,null,null,null,null,null,null,null,null,null,null,null,null,null,null,null,null,null,null,null,null,null,null,null,null,null,"RENAULT",19,"CLIO FULL",3,"SEDAN"]
[null,null,null,null,null,null,null,null,null,null,null,null,null,null,null,null,null,null,null,null,null,null,null,null,null,null,null,null,null,null,null,"RENAULT",19,"SCENIC",4,"SEDAN"]
[null,null,null,null,null,null,null,null,null,null,null,null,null,null,null,null,null,null,null,null,null,null,null,null,null,null,null,null,null,null,null,"RENAULT",19,"MEGANE",5,"SEDAN"]
[null,null,null,null,null,null,null,null,null,null,null,null,null,null,null,null,null,null,null,null,null,null,null,null,null,null,null,null,null,null,null,"RENAULT",19,"KANGOO",6,"STATION WAGON"]
[null,null,null,null,null,null,null,null,null,null,null,null,null,null,null,null,null,null,null,null,null,null,null,null,null,null,null,null,null,null,null,"RENAULT",19,"LAGUNA",7,"SEDAN"]
[null,null,null,null,null,null,null,null,null,null,null,null,null,null,null,null,null,null,null,null,null,null,null,null,null,null,null,null,null,null,null,"RENAULT",19,"19 TRICORPS",8,"SEDAN"]
[null,null,null,null,null,null,null,null,null,null,null,null,null,null,null,null,null,null,null,null,null,null,null,null,null,null,null,null,null,null,null,"RENAULT",19,"SYMBOL",9,"SEDAN"]
[null,null,null,null,null,null,null,null,null,null,null,null,null,null,null,null,null,null,null,null,null,null,null,null,null,null,null,null,null,null,null,"SAAB",45,900,1,"SEDAN"]
[null,null,null,null,null,null,null,null,null,null,null,null,null,null,null,null,null,null,null,null,null,null,null,null,null,null,null,null,null,null,null,"SAAB",45,950,2,"SEDAN"]
[null,null,null,null,null,null,null,null,null,null,null,null,null,null,null,null,null,null,null,null,null,null,null,null,null,null,null,null,null,null,null,"SAEHAN",57,"N/D",1,"SEDAN"]
[null,null,null,null,null,null,null,null,null,null,null,null,null,null,null,null,null,null,null,null,null,null,null,null,null,null,null,null,null,null,null,"SAMSUNG",74,"SV-110",1,"SEDAN"]
[null,null,null,null,null,null,null,null,null,null,null,null,null,null,null,null,null,null,null,null,null,null,null,null,null,null,null,null,null,null,null,"SANGYONG",42,"MUSSO",1,"JEEP"]
[null,null,null,null,null,null,null,null,null,null,null,null,null,null,null,null,null,null,null,null,null,null,null,null,null,null,null,null,null,null,null,"SANGYONG",42,"REXTON RX320",2,"JEEP"]
[null,null,null,null,null,null,null,null,null,null,null,null,null,null,null,null,null,null,null,null,null,null,null,null,null,null,null,null,null,null,null,"SEAT",105,"COUPE",1,"COUPE"]
[null,null,null,null,null,null,null,null,null,null,null,null,null,null,null,null,null,null,null,null,null,null,null,null,null,null,null,null,null,null,null,"SKODA",20,"FELICIA",1,"SEDAN"]
[null,null,null,null,null,null,null,null,null,null,null,null,null,null,null,null,null,null,null,null,null,null,null,null,null,null,null,null,null,null,null,"SKODA",20,"1300 PICK UP",2,"PICK-UP"]
[null,null,null,null,null,null,null,null,null,null,null,null,null,null,null,null,null,null,null,null,null,null,null,null,null,null,null,null,null,null,null,"SKODA",20,"FABIA",3,"SEDAN"]
[null,null,null,null,null,null,null,null,null,null,null,null,null,null,null,null,null,null,null,null,null,null,null,null,null,null,null,null,null,null,null,"SKODA",20,"OCTAVIA",4,"SEDAN"]
[null,null,null,null,null,null,null,null,null,null,null,null,null,null,null,null,null,null,null,null,null,null,null,null,null,null,null,null,null,null,null,"SKODA",20,"FAVORIT",5,"SEDAN"]
[null,null,null,null,null,null,null,null,null,null,null,null,null,null,null,null,null,null,null,null,null,null,null,null,null,null,null,null,null,null,null,"SKODA",20,"FORMAN",6,"SEDAN"]
[null,null,null,null,null,null,null,null,null,null,null,null,null,null,null,null,null,null,null,null,null,null,null,null,null,null,null,null,null,null,null,"SKODA",20,"SUPERB COMFORT",7,"SEDAN"]
[null,null,null,null,null,null,null,null,null,null,null,null,null,null,null,null,null,null,null,null,null,null,null,null,null,null,null,null,null,null,null,"SUBARU",58,"IMPREZA",1,"SEDAN"]
[null,null,null,null,null,null,null,null,null,null,null,null,null,null,null,null,null,null,null,null,null,null,null,null,null,null,null,null,null,null,null,"SUBARU",58,"LEGACY",2,"STATION WAGON"]
[null,null,null,null,null,null,null,null,null,null,null,null,null,null,null,null,null,null,null,null,null,null,null,null,null,null,null,null,null,null,null,"SUBARU",58,"GL10",3,"SEDAN"]
[null,null,null,null,null,null,null,null,null,null,null,null,null,null,null,null,null,null,null,null,null,null,null,null,null,null,null,null,null,null,null,"SUBARU",58,"A22L",4,"SEDAN"]
[null,null,null,null,null,null,null,null,null,null,null,null,null,null,null,null,null,null,null,null,null,null,null,null,null,null,null,null,null,null,null,"SUBARU",58,"FORESTER",5,"SEDAN"]
[null,null,null,null,null,null,null,null,null,null,null,null,null,null,null,null,null,null,null,null,null,null,null,null,null,null,null,null,null,null,null,"SUZUKI",60,"FORSA",11,"COUPE"]
[null,null,null,null,null,null,null,null,null,null,null,null,null,null,null,null,null,null,null,null,null,null,null,null,null,null,null,null,null,null,null,"SUZUKI",60,"GRAND VITARA",12,"JEEP"]
[null,null,null,null,null,null,null,null,null,null,null,null,null,null,null,null,null,null,null,null,null,null,null,null,null,null,null,null,null,null,null,"SUZUKI",60,"INTRUDER",13,"SEDAN"]
[null,null,null,null,null,null,null,null,null,null,null,null,null,null,null,null,null,null,null,null,null,null,null,null,null,null,null,null,null,null,null,"SUZUKI",60,"SAMURAI",16,"JEEP"]
[null,null,null,null,null,null,null,null,null,null,null,null,null,null,null,null,null,null,null,null,null,null,null,null,null,null,null,null,null,null,null,"SUZUKI",60,"SIDERICK",17,"JEEP"]
[null,null,null,null,null,null,null,null,null,null,null,null,null,null,null,null,null,null,null,null,null,null,null,null,null,null,null,null,null,null,null,"SUZUKI",60,"SJ 413",18,"JEEP"]
[null,null,null,null,null,null,null,null,null,null,null,null,null,null,null,null,null,null,null,null,null,null,null,null,null,null,null,null,null,null,null,"SUZUKI",60,"VITARA",22,"JEEP"]
[null,null,null,null,null,null,null,null,null,null,null,null,null,null,null,null,null,null,null,null,null,null,null,null,null,null,null,null,null,null,null,"SUZUKI",60,"LJ80",29,"JEEP"]
[null,null,null,null,null,null,null,null,null,null,null,null,null,null,null,null,null,null,null,null,null,null,null,null,null,null,null,null,null,null,null,"SUZUKI",60,"JIMNY 4X4",30,"JEEP"]
[null,null,null,null,null,null,null,null,null,null,null,null,null,null,null,null,null,null,null,null,null,null,null,null,null,null,null,null,null,null,null,"TALBOT",59,"ORIZONT",1,"SEDAN"]
[null,null,null,null,null,null,null,null,null,null,null,null,null,null,null,null,null,null,null,null,null,null,null,null,null,null,null,null,null,null,null,"TATA",75,"SAFARI",2,"JEEP"]
[null,null,null,null,null,null,null,null,null,null,null,null,null,null,null,null,null,null,null,null,null,null,null,null,null,null,null,null,null,null,null,"TATA",75,"INDICA",3,"SEDAN"]
[null,null,null,null,null,null,null,null,null,null,null,null,null,null,null,null,null,null,null,null,null,null,null,null,null,null,null,null,null,null,null,"TOYOTA",21,"TERCEL",1,"SEDAN"]
[null,null,null,null,null,null,null,null,null,null,null,null,null,null,null,null,null,null,null,null,null,null,null,null,null,null,null,null,null,null,null,"TOYOTA",21,"YARIS",2,"SEDAN"]
[null,null,null,null,null,null,null,null,null,null,null,null,null,null,null,null,null,null,null,null,null,null,null,null,null,null,null,null,null,null,null,"TOYOTA",21,"YARIS HATCHBACK 1.3",3,"STATION WAGON"]
[null,null,null,null,null,null,null,null,null,null,null,null,null,null,null,null,null,null,null,null,null,null,null,null,null,null,null,null,null,null,null,"TOYOTA",21,"COROLLA",4,"SEDAN"]
[null,null,null,null,null,null,null,null,null,null,null,null,null,null,null,null,null,null,null,null,null,null,null,null,null,null,null,null,null,null,null,"TOYOTA",21,"STOUT II",5,"PICK-UP"]
[null,null,null,null,null,null,null,null,null,null,null,null,null,null,null,null,null,null,null,null,null,null,null,null,null,null,null,null,null,null,null,"TOYOTA",21,"STOUT 2200 CHASIS",6,"PICK-UP"]
[null,null,null,null,null,null,null,null,null,null,null,null,null,null,null,null,null,null,null,null,null,null,null,null,null,null,null,null,null,null,null,"TOYOTA",21,"HILUX C/S 2.4 4X2",7,"PICK-UP"]
[null,null,null,null,null,null,null,null,null,null,null,null,null,null,null,null,null,null,null,null,null,null,null,null,null,null,null,null,null,null,null,"TOYOTA",21,"HILUX D/C 2.4 4X2",8,"PICK-UP"]
[null,null,null,null,null,null,null,null,null,null,null,null,null,null,null,null,null,null,null,null,null,null,null,null,null,null,null,null,null,null,null,"TOYOTA",21,"HILUX D/C 2.4 4X4",9,"PICK-UP"]
[null,null,null,null,null,null,null,null,null,null,null,null,null,null,null,null,null,null,null,null,null,null,null,null,null,null,null,null,null,null,null,"TOYOTA",21,"HILUX D/C 2.4 4X4 FULL",10,"PICK-UP"]
[null,null,null,null,null,null,null,null,null,null,null,null,null,null,null,null,null,null,null,null,null,null,null,null,null,null,null,null,null,null,null,"TOYOTA",21,"LAND CRUSIER 3P",11,"JEEP"]
[null,null,null,null,null,null,null,null,null,null,null,null,null,null,null,null,null,null,null,null,null,null,null,null,null,null,null,null,null,null,null,"TOYOTA",21,"LAND CRUSIER 5P",12,"JEEP"]
[null,null,null,null,null,null,null,null,null,null,null,null,null,null,null,null,null,null,null,null,null,null,null,null,null,null,null,null,null,null,null,"TOYOTA",21,"LAND CRUSIER PRADO 3P",13,"JEEP"]
[null,null,null,null,null,null,null,null,null,null,null,null,null,null,null,null,null,null,null,null,null,null,null,null,null,null,null,null,null,null,null,"TOYOTA",21,"LAND CRUSIER PRADO 5P",14,"JEEP"]
[null,null,null,null,null,null,null,null,null,null,null,null,null,null,null,null,null,null,null,null,null,null,null,null,null,null,null,null,null,null,null,"TOYOTA",21,"4 RUNNER",15,"JEEP"]
[null,null,null,null,null,null,null,null,null,null,null,null,null,null,null,null,null,null,null,null,null,null,null,null,null,null,null,null,null,null,null,"TOYOTA",21,"RAV4 3P",16,"JEEP"]
[null,null,null,null,null,null,null,null,null,null,null,null,null,null,null,null,null,null,null,null,null,null,null,null,null,null,null,null,null,null,null,"TOYOTA",21,"RAV4 5P",17,"JEEP"]
[null,null,null,null,null,null,null,null,null,null,null,null,null,null,null,null,null,null,null,null,null,null,null,null,null,null,null,null,null,null,null,"TOYOTA",21,"CAMRY",20,"SEDAN"]
[null,null,null,null,null,null,null,null,null,null,null,null,null,null,null,null,null,null,null,null,null,null,null,null,null,null,null,null,null,null,null,"TOYOTA",21,"CORONA",21,"SEDAN"]
[null,null,null,null,null,null,null,null,null,null,null,null,null,null,null,null,null,null,null,null,null,null,null,null,null,null,null,null,null,null,null,"TOYOTA",21,"CRESSIDA",22,"SEDAN"]
[null,null,null,null,null,null,null,null,null,null,null,null,null,null,null,null,null,null,null,null,null,null,null,null,null,null,null,null,null,null,null,"TOYOTA",21,"CROWN",23,"SEDAN"]
[null,null,null,null,null,null,null,null,null,null,null,null,null,null,null,null,null,null,null,null,null,null,null,null,null,null,null,null,null,null,null,"TOYOTA",21,"TACOMA",26,"STATION WAGON"]
[null,null,null,null,null,null,null,null,null,null,null,null,null,null,null,null,null,null,null,null,null,null,null,null,null,null,null,null,null,null,null,"TOYOTA",21,"STOUT C/S",27,"PICK-UP"]
[null,null,null,null,null,null,null,null,null,null,null,null,null,null,null,null,null,null,null,null,null,null,null,null,null,null,null,null,null,null,null,"TOYOTA",21,800,28,"PICK-UP"]
[null,null,null,null,null,null,null,null,null,null,null,null,null,null,null,null,null,null,null,null,null,null,null,null,null,null,null,null,null,null,null,"TOYOTA",21,"HILUX C/S 2.4 4X4",29,"PICK-UP"]
[null,null,null,null,null,null,null,null,null,null,null,null,null,null,null,null,null,null,null,null,null,null,null,null,null,null,null,null,null,null,null,"TOYOTA",21,"LAND CRUISER FZJ C/S",30,"PICK-UP"]
[null,null,null,null,null,null,null,null,null,null,null,null,null,null,null,null,null,null,null,null,null,null,null,null,null,null,null,null,null,null,null,"TOYOTA",21,"HIGHLANDER",32,"JEEP"]
[null,null,null,null,null,null,null,null,null,null,null,null,null,null,null,null,null,null,null,null,null,null,null,null,null,null,null,null,null,null,null,"TOYOTA",21,"1000 P/U",35,"PICK-UP"]
[null,null,null,null,null,null,null,null,null,null,null,null,null,null,null,null,null,null,null,null,null,null,null,null,null,null,null,null,null,null,null,"TOYOTA",21,"YARIS SPORT",36,"SEDAN"]
[null,null,null,null,null,null,null,null,null,null,null,null,null,null,null,null,null,null,null,null,null,null,null,null,null,null,null,null,null,null,null,"TOYOTA",21,"NITRO 3P",37,"COUPE"]
[null,null,null,null,null,null,null,null,null,null,null,null,null,null,null,null,null,null,null,null,null,null,null,null,null,null,null,null,null,null,null,"VOLKSWAGEN",22,"GOL 3P",1,"COUPE"]
[null,null,null,null,null,null,null,null,null,null,null,null,null,null,null,null,null,null,null,null,null,null,null,null,null,null,null,null,null,null,null,"VOLKSWAGEN",22,"GOL 5P",2,"SEDAN"]
[null,null,null,null,null,null,null,null,null,null,null,null,null,null,null,null,null,null,null,null,null,null,null,null,null,null,null,null,null,null,null,"VOLKSWAGEN",22,"GOL SPORT",3,"SEDAN"]
[null,null,null,null,null,null,null,null,null,null,null,null,null,null,null,null,null,null,null,null,null,null,null,null,null,null,null,null,null,null,null,"VOLKSWAGEN",22,"SAVEIRO",4,"PICK-UP"]
[null,null,null,null,null,null,null,null,null,null,null,null,null,null,null,null,null,null,null,null,null,null,null,null,null,null,null,null,null,null,null,"VOLKSWAGEN",22,"GOLF",5,"SEDAN"]
[null,null,null,null,null,null,null,null,null,null,null,null,null,null,null,null,null,null,null,null,null,null,null,null,null,null,null,null,null,null,null,"VOLKSWAGEN",22,"POLO HATCHBACK",6,"STATION WAGON"]
[null,null,null,null,null,null,null,null,null,null,null,null,null,null,null,null,null,null,null,null,null,null,null,null,null,null,null,null,null,null,null,"VOLKSWAGEN",22,"POLO",7,"SEDAN"]
[null,null,null,null,null,null,null,null,null,null,null,null,null,null,null,null,null,null,null,null,null,null,null,null,null,null,null,null,null,null,null,"VOLKSWAGEN",22,"JETTA 4P",8,"SEDAN"]
[null,null,null,null,null,null,null,null,null,null,null,null,null,null,null,null,null,null,null,null,null,null,null,null,null,null,null,null,null,null,null,"VOLKSWAGEN",22,"VENTO",9,"SEDAN"]
[null,null,null,null,null,null,null,null,null,null,null,null,null,null,null,null,null,null,null,null,null,null,null,null,null,null,null,null,null,null,null,"VOLKSWAGEN",22,"PARATI",10,"SEDAN"]
[null,null,null,null,null,null,null,null,null,null,null,null,null,null,null,null,null,null,null,null,null,null,null,null,null,null,null,null,null,null,null,"VOLKSWAGEN",22,"SANTANA 4P",11,"SEDAN"]
[null,null,null,null,null,null,null,null,null,null,null,null,null,null,null,null,null,null,null,null,null,null,null,null,null,null,null,null,null,null,null,"VOLKSWAGEN",22,"AMAZON",12,"SEDAN"]
[null,null,null,null,null,null,null,null,null,null,null,null,null,null,null,null,null,null,null,null,null,null,null,null,null,null,null,null,null,null,null,"VOLKSWAGEN",22,"BRASILIA",13,"SEDAN"]
[null,null,null,null,null,null,null,null,null,null,null,null,null,null,null,null,null,null,null,null,null,null,null,null,null,null,null,null,null,null,null,"VOLKSWAGEN",22,"ESCARABAJO",15,"COUPE"]
[null,null,null,null,null,null,null,null,null,null,null,null,null,null,null,null,null,null,null,null,null,null,null,null,null,null,null,null,null,null,null,"VOLKSWAGEN",22,"POLO SPORT",17,"SEDAN"]
[null,null,null,null,null,null,null,null,null,null,null,null,null,null,null,null,null,null,null,null,null,null,null,null,null,null,null,null,null,null,null,"VOLKSWAGEN",22,"QUAMTUM",18,"STATION WAGON"]
[null,null,null,null,null,null,null,null,null,null,null,null,null,null,null,null,null,null,null,null,null,null,null,null,null,null,null,null,null,null,null,"VOLKSWAGEN",22,"PASSAT",19,"SEDAN"]
[null,null,null,null,null,null,null,null,null,null,null,null,null,null,null,null,null,null,null,null,null,null,null,null,null,null,null,null,null,null,null,"VOLKSWAGEN",22,"GOLF GTI",20,"COUPE"]
[null,null,null,null,null,null,null,null,null,null,null,null,null,null,null,null,null,null,null,null,null,null,null,null,null,null,null,null,null,null,null,"VOLKSWAGEN",22,"BETTLE",21,"COUPE"]
[null,null,null,null,null,null,null,null,null,null,null,null,null,null,null,null,null,null,null,null,null,null,null,null,null,null,null,null,null,null,null,"VOLKSWAGEN",22,"BORA",22,"SEDAN"]
[null,null,null,null,null,null,null,null,null,null,null,null,null,null,null,null,null,null,null,null,null,null,null,null,null,null,null,null,null,null,null,"VOLKSWAGEN",22,"FOX SPORT",23,"SEDAN"]
[null,null,null,null,null,null,null,null,null,null,null,null,null,null,null,null,null,null,null,null,null,null,null,null,null,null,null,null,null,null,null,"VOLKSWAGEN",22,"FOX 2P",24,"COUPE"]
[null,null,null,null,null,null,null,null,null,null,null,null,null,null,null,null,null,null,null,null,null,null,null,null,null,null,null,null,null,null,null,"VOLKSWAGEN",22,"FOX 4P",25,"SEDAN"]
[null,null,null,null,null,null,null,null,null,null,null,null,null,null,null,null,null,null,null,null,null,null,null,null,null,null,null,null,null,null,null,"VOLVO",23,460,1,"SEDAN"]
[null,null,null,null,null,null,null,null,null,null,null,null,null,null,null,null,null,null,null,null,null,null,null,null,null,null,null,null,null,null,null,"VOLVO",23,"V70",2,"SEDAN"]
[null,null,null,null,null,null,null,null,null,null,null,null,null,null,null,null,null,null,null,null,null,null,null,null,null,null,null,null,null,null,null,"VOLVO",23,"S60",3,"SEDAN"]
[null,null,null,null,null,null,null,null,null,null,null,null,null,null,null,null,null,null,null,null,null,null,null,null,null,null,null,null,null,null,null,"VOLVO",23,240,4,"SEDAN"]
[null,null,null,null,null,null,null,null,null,null,null,null,null,null,null,null,null,null,null,null,null,null,null,null,null,null,null,null,null,null,null,"VOLVO",23,850,5,"SEDAN"]
[null,null,null,null,null,null,null,null,null,null,null,null,null,null,null,null,null,null,null,null,null,null,null,null,null,null,null,null,null,null,null,"VOLVO",23,240,6,"SEDAN"]
[null,null,null,null,null,null,null,null,null,null,null,null,null,null,null,null,null,null,null,null,null,null,null,null,null,null,null,null,null,null,null,"VOLVO",23,"122 S",7,"SEDAN"]
[null,null,null,null,null,null,null,null,null,null,null,null,null,null,null,null,null,null,null,null,null,null,null,null,null,null,null,null,null,null,null,"VOLVO",23,244,8,"SEDAN"]
[null,null,null,null,null,null,null,null,null,null,null,null,null,null,null,null,null,null,null,null,null,null,null,null,null,null,null,null,null,null,null,"VOLVO",23,"940 GL",9,"SEDAN"]
[null,null,null,null,null,null,null,null,null,null,null,null,null,null,null,null,null,null,null,null,null,null,null,null,null,null,null,null,null,null,null,"VOLVO",23,"430SE",10,"SEDAN"]
[null,null,null,null,null,null,null,null,null,null,null,null,null,null,null,null,null,null,null,null,null,null,null,null,null,null,null,null,null,null,null,"VOLVO",23,440,11,"SEDAN"]
[null,null,null,null,null,null,null,null,null,null,null,null,null,null,null,null,null,null,null,null,null,null,null,null,null,null,null,null,null,null,null,"VOLVO",23,740,12,"SEDAN"]
[null,null,null,null,null,null,null,null,null,null,null,null,null,null,null,null,null,null,null,null,null,null,null,null,null,null,null,null,null,null,null,"VOLVO",23,960,13,"SEDAN"]
[null,null,null,null,null,null,null,null,null,null,null,null,null,null,null,null,null,null,null,null,null,null,null,null,null,null,null,null,null,null,null,"VOLVO",23,760,14,"SEDAN"]
[null,null,null,null,null,null,null,null,null,null,null,null,null,null,null,null,null,null,null,null,null,null,null,null,null,null,null,null,null,null,null,"VOLVO",23,"S40",15,"SEDAN"]
[null,null,null,null,null,null,null,null,null,null,null,null,null,null,null,null,null,null,null,null,null,null,null,null,null,null,null,null,null,null,null,"VOLVO",23,"S80",16,"SEDAN"]
[null,null,null,null,null,null,null,null,null,null,null,null,null,null,null,null,null,null,null,null,null,null,null,null,null,null,null,null,null,null,null,"VOLVO",23,"S70",17,"SEDAN"]
[null,null,null,null,null,null,null,null,null,null,null,null,null,null,null,null,null,null,null,null,null,null,null,null,null,null,null,null,null,null,null,"VOLVO",23,"S90",19,"SEDAN"]
[null,null,null,null,null,null,null,null,null,null,null,null,null,null,null,null,null,null,null,null,null,null,null,null,null,null,null,null,null,null,null,"WORLDSTAR",99,"1300 CC",1,"PICK-UP"]
[null,null,null,null,null,null,null,null,null,null,null,null,null,null,null,null,null,null,null,null,null,null,null,null,null,null,null,null,null,null,null,"ZASTAVA",61,"SEDAN",1,"SEDAN"]
[null,null,null,null,null,null,null,null,null,null,null,null,null,null,null,null,null,null,null,null,null,null,null,null,null,null,null,null,null,null,null,"ZASTAVA",61,1100,2,"SEDAN"]
[null,null,null,null,null,null,null,null,null,null,null,null,null,null,null,"V2 - Producto Empresas"]
[null,null,null," ",null,null,null,null,null,null,null,null,null,null,null,"Elaborado por: Hans Andrade "]
[null,null,null,null,null,null,null,null,null,null,null,null,null,null,null,"Actualizado Por: Gabriela Báez"]
[null,null,null,null,null,null,null,null,null,null,null,null,null,null,null,"Fecha: 15/17/2024"]

{"sheet":"COTIZADOR","index":5,"n_rows":689,"n_cols":81,"rows_kept":689,"cut":false,"hidden":false,"merged":[[4,3,4,13],[2,3,2,13],[85,2,85,3],[70,11,70,14],[64,2,64,3],[64,5,64,14],[56,2,56,3],[56,5,56,14],[84,2,84,3],[72,5,72,8],[70,2,70,3],[70,5,70,8],[72,2,72,3],[62,2,62,3],[62,5,62,14],[68,2,68,14],[66,5,66,14],[66,2,66,3],[92,74,92,80],[86,74,86,80],[87,74,87,80],[88,74,88,80],[89,74,89,80],[90,74,90,80],[91,74,91,80],[54,2,54,3],[54,5,54,14],[58,2,58,3],[58,5,58,14],[60,2,60,3],[60,5,60,14],[45,5,45,14],[50,2,50,3],[50,5,50,14],[52,2,52,3],[52,5,52,14],[13,2,13,3],[13,5,13,14],[7,2,7,14],[9,2,9,3],[15,2,15,14],[29,2,29,3],[29,5,29,14],[27,2,27,3],[40,2,40,3],[37,5,37,14],[31,2,31,3],[31,5,31,14],[39,2,39,3],[39,5,39,14],[17,2,17,3],[17,5,17,8],[27,5,27,14],[23,2,23,14],[25,2,25,3],[25,5,25,14],[17,11,17,14],[19,2,19,3],[19,5,19,8],[19,11,19,14],[21,2,21,3],[21,5,21,8],[21,11,21,14],[170,2,170,3],[158,2,158,3],[163,2,163,3],[33,2,33,3],[33,5,33,14],[41,2,41,3],[41,5,41,14],[47,2,47,3],[47,5,47,14],[43,2,43,3],[37,2,37,3],[40,5,40,14],[35,2,35,3],[35,5,35,14],[43,5,43,14],[45,2,45,3]]}
[]
[]
[null,null,null,"FINANCIAMIENTO VEHICULAR"]
[]
[null,null,null,"COTIZADOR"]
[]
[]
[null,null,null,null,null,null,null,null,null,null,null,null,null,null,null,null,null,null,null,null,null,null,null,null,null,null,null,null,null,null,null,null,null,null,null,null,null,null,null,null,null," "]
[]
[null,null,"FECHA DE COTIZACION",null,null,{"$f":"TODAY()","v":"2025-02-07"},null,"AAAA/MM/DD"]
[]
[]
[]
[null,null,"NOMBRES Y APELLIDOS DEL VENDEDOR:",null,null,"NOMBRE Y APELLIDO"]
[]
[null,null,"DATOS INFORMATIVOS DEL CLIENTE"]
[]
[null,null,"APELLIDOS DEL CLIENTE:",null,null,"PRIMER APELLIDO",null,null,null,null,null,"SEGUNDO APELLIDO"]
[]
[null,null,"NOMBRES DEL CLIENTE:",null,null,"PRIMER NOMBRE",null,null,null,null,null,"SEGUNDO NOMBRE",null,null,null,null,{"$f":"CONCATENATE(F20,\" \",L20)","v":"PRIMER NOMBRE SEGUNDO NOMBRE"}]
[]
[null,null,"TELEFONOS:",null,null,"CELULAR",null,null,null,null,null,"CONVENCIONAL"]
[]
[null,null,"DATOS DEL VEHICULO"]
[]
[null,null,"MARCA",null,null,"MAZDA"]
[]
[null,null,"MODELO:",null,null,"CX3"]
[]
[null,null,"AÑO:",null,null,2019]
[]
[null,null,"ESTADO CIVIL:",null,null,"Casado"]
[]
[null,null,"VALOR DE FINANCIAMIENTO DEL VEHICULO (INCLUIDO IVA):",null,null,10000,null,null,null,null,null,null,null,null,null,null,"Se ingresa",null,null,null,null,null,null,null,null,null,null,null,null,null,null,null,null,null,null,null,null,null,null,null,null,null,null,null,null,null,null,null,null,null,null,null,null,null,null,null,null,null,null,null,null,null,null,null,null,null,null,null,null,null,null,null,null,null,null,null,null,"A",25000,"S",30000]
[null,null,null,null,null,null,null,null,null,null,null,null,null,null,null,null,null,null,null,{"$f":"+F41/F34","v":0},null,null,null,null,null,null,null,null,null,null,null,null,null,null,null,null,null,null,null,null,null,null,null,null,null,null,null,null,null,null,null,null,null,null,null,null,null,null,null,null,null,null,null,null,null,null,null,null,null,null,null,null,null,null,null,null,null,null,null,"S"]
[null,null,"VALIDACION % DE ENTRADA:",null,null,{"$f":"IF(F41/F34>=25%,F41/F34,\"ENTRADA MENOR AL 25%\")","v":"ENTRADA MENOR AL 25%"},null,null,null,null,null,null,null,null,null,null,"Calculado, no uede ser inferior al 25%",null,null,null,null,null,null,null,null,null,null,null,null,null,null,null,null,null,null,null,null,null,null,null,null,null,null,null,null,null,null,null,null,null,null,null,null,null,null,null,null,null,null,null,null,null,null,null,null,null,null,null,null,null,null,null,null,null,null,null,null,null,35000,"C",{"$f":"+CC34*25%","v":7500}]
[]
[null,null,"VALOR MINIMO DE ENTRADA:",null,null,null,null,null,null,null,null,null,null,null,null,null,"Se ingresa",null,null,null,null,null,null,null,null,null,null,null,null,null,null,null,null,null,null,null,null,null,null,null,null,null,null,null,null,null,null,null,null,null,null,null,null,null,null,null,null,null,null,null,null,null,null,null,null,null,null,null,null,null,null,null,null,null,null,null,null,null,null,null,{"$f":"+CA36-CC36","v":27500}]
[]
[null,null,"VALOR TOTAL DEL VEHICULO (INCLUIDO IVA):",null,null,35000]
[null,null,"VALOR TOTAL DE VEHICULO"]
[null,null,"PLAZO MESES FINANCIAMIENTO:",null,null,24,null,null,null,null,null,null,null,null,null,null,"Ingresa en meses o años"]
[]
[null,null,"TIPO DE CLIENTE:",null,null,"PERSONAL",null,null,null,null,null,null,null,null,null,null,"Selecciona"]
[]
[null,null,"TIPO DEL VEHICULO:",null,null,"LIVIANO",null,null,null,null,null,null,null,null,null,null,"Selecciona"]
[]
[null,null,"TASA MAXIMA DE INTERES VIGENTE DINERS:",null,null,{"$f":"VLOOKUP(F44,AQ87:AR90,2,FALSE)","v":0.156},null,null,null,null,null,null,null,null,null,null,"Recupera del parametro"]
[]
[]
[null,null,"DISPOSITIVO:",null,null,"Con dispositivo Concesionario",null,null,null,null,null,null,null,null,null,null,"No se muestra, para efectos del simulador aplicar un valor promedio de 40 USD"]
[]
[null,null,"PLAZO GASTOS LEGALES:",null,null,"CORRIENTE",null,null,null,null,null,null,null,null,null,null,"Seleccion"]
[]
[null,null,"CUOTA MENSUAL SEGURO VEHICULAR PRIMER AÑO:",null,null,{"$f":"'AIG- Cotizador Seguro'!$I$6","v":125.58383333333335},null,null,null,null,null,null,null,null,null,null,"Calculo"]
[]
[null,null,"CUOTA GASTOS LEGALES:",null,null,{"$f":"IF($F$53=\"3 MESES SIN INTERESES\",FORM!$F$133/3,FORM!$F$133)","v":527.71499999999992},null,null,null,null,null,null,null,null,null,null,"Calculo"]
[]
[null,null,"CUOTA MENSUAL RASTREO SATELITAL:",null,null,{"$f":"+FORM!F139","v":0},null,null,null,null,null,null,null,null,null,null,"Calculo"]
[]
[null,null,"CUOTA MENSUAL SEGURO DESGRAVAMEN",null,null,"0,099% MENSUAL SOBRE EL SALDO DE LA TARJETA DE CREDITO"]
[]
[null,null,"CUOTA MENSUAL FINANCIAMIENTO VEHICULO:",null,null,{"$f":"+FORM!F143","v":488.72375364369611},null,null,null,null,null,null,null,null,null,null,"Calculo"]
[]
[null,null,"VALOR A PAGAR MENSUALMENTE SIN G. LEGALES:",null,null,{"$f":"F55+F59+F63","v":614.30758697702947},null,null,null,null,null,null,null,null,null,null,"Calculo"]
[]
[null,null,"CONTRIBUCION SOLCA (0.5%):",null,null,{"$f":"IF(F53=\"3 MESES SIN INTERESES\",$D$167*((0.5%/12)*3)+(0.5%*F71),(0.5%*F71))","v":50},null,null,null,null,null,null,null,null,null,null,"Calculo"]
[]
[]
[null,null,null,null,null,null,null,null,null,null,null,null,null,null,null,null,"Calculado"]
[null,null,"VALOR DE FINANCIAMIENTO:",null,null,{"$f":"+F34-F41","v":10000}]
[]
[null,null,"INTERESES:",null,null,{"$f":"+PAGARE!D5-COTIZADOR!F71","v":1729.3700874487076},null,null,null,null,null,null,null,null,null,null,"Calculado"]
[]
[]
[]
[]
[]
[]
[]
[]
[]
[]
[]
[]
[null,null,"DISPOSITIVOS",null,null,null,"AÑO",null,"VALOR LEGALES",null,"CIUDAD",null,null,"MES",null,null,"COLOR",null,"CÓDIGO COLOR","Min","Max","TASA","TASA","PRIMA US $","SÚPER BANCOS","S.S. Campesino","IVA","DERECHOS EMISIÓN","PRIMA TOTAL","MARCA SISE","CÓDIGO MARCA SISE","MARCA","CÓDIGO MARCA SISE","MODELO","CÓDIGO MODELO SISE","TIPO","GENERO","DIA","ESTADO CIVIL","% USO","MESES","GASTOS LEGALES",null,"tasa por producto","PAÍS DE ORIGEN",null,"% ENTRADA","% RESTANTE","VALOR RESTANTE","CALCULO DÍAS",null,"BIN","FECHA PAGO","EXTRAER1","EXTRAER 2"]
[null,null,"TRACKLINK INTERACTIVO 12",46.573333333333345,469.28,null,2018,null,37.184000000000005,null,"QUITO",null,null,"ENERO",null,null,"AMARILLO",null,1,0,0,4.3,{"$f":"+(V87/12)/100","v":3.5833333333333333E-3},{"$f":"ROUND((FORM!$F$101*$W$87),2)","v":35.83},{"$f":"ROUND(($X$87*3.5%),2)","v":1.25},{"$f":"+X87*0.5%","v":0.17915},{"$f":"SUM(X87:Z87)*12%","v":4.4710979999999996},0.04,{"$f":"SUM(X87:AB87)","v":41.770247999999995},"ALFA ROMEO",24,"ALFA ROMEO",24,146,1,"SEDAN","MASCULINO",1,"SOLTERO",5,12,"CORRIENTE","PERSONAL",0.156,"ALEMANIA",null,{"$f":"+F41/F34","v":0},{"$f":"100%-AU87","v":1},{"$f":"+F34-F41","v":10000},{"$f":"+F42/12/12","v":0.16666666666666666},null,360041,16,{"$f":"MID(F64,1,6)","v":""},{"$f":"MID(F64,7,8)","v":""}]
[null,null,"TRACKLINK INTERACTIVO 24",33.553333333333335,592.48,null,2019,null,17.920000000000002,null,"GUAYAQUIL",null,null,"FEBRERO",null,null,"AZUL",null,2,0,24999,3.5,{"$f":"+(V88/12)/100","v":2.9166666666666668E-3},{"$f":"ROUND((FORM!$F$101*$W$88),2)","v":29.17},{"$f":"ROUND(($X$88*3.5%),2)","v":1.02},{"$f":"+X88*0.5%","v":0.14585000000000001},{"$f":"SUM(X88:Z88)*12%","v":3.6403020000000001},0.04,{"$f":"SUM(X88:AB88)","v":34.016151999999998},"AUDI",1,"ALFA ROMEO",24,155,2,"SEDAN","FEMENINO",2,"CASADO",10,{"$f":"AO87+12","v":24},"3 MESES SIN INTERESES","CORPORATIVO",0.11509999999999999,"ARGENTINA",null,null,null,null,null,null,361329,16]
[null,null,"TRACKLINK INTERACTIVO 36",29.213333333333335,715.68,null,2020,null,1.2,null,"CUENCA",null,null,"MARZO",null,null,"BEIGE",null,3,{"$f":"+U88+0.01","v":24999.01},39999,3,{"$f":"+(V89/12)/100","v":2.5000000000000001E-3},{"$f":"ROUND((FORM!$F$101*$W$89),2)","v":25},{"$f":"ROUND(($X$89*3.5%),2)","v":0.88},{"$f":"+X89*0.5%","v":0.125},{"$f":"SUM(X89:Z89)*12%","v":3.1205999999999996},0.04,{"$f":"SUM(X89:AB89)","v":29.165599999999998},"AUSTIN",26,"ALFA ROMEO",24,156,3,"SEDAN",null,3,"VIUDO",15,{"$f":"AO88+12","v":36},null,"EMPRESARIAL",0.1222,"BRASIL",null,null,null,null,null,null,361349,1]
[null,null,"TRACKLINK INTERACTIVO 48",27.043333333333337,962.08,null,2021,null,1000,null,"AMBATO",null,null,"ABRIL",null,null,"BLANCO",null,4,{"$f":"+U89+0.01","v":39999.01},200000,2.5,{"$f":"+(V90/12)/100","v":2.0833333333333333E-3},{"$f":"ROUND((FORM!$F$101*$W$90),2)","v":20.83},{"$f":"ROUND(($X$90*3.5%),2)","v":0.73},{"$f":"+X90*0.5%","v":0.10414999999999999},{"$f":"SUM(X90:Z90)*12%","v":2.5996979999999996},0.04,{"$f":"SUM(X90:AB90)","v":24.303847999999999},"BMW",2,"ALFA ROMEO",24,165,4,"SEDAN",null,4,"DIVORCIADO",20,{"$f":"AO89+12","v":48},null,"PYME",0.1149,"CANADÁ",null,null,null,null,null,null,362062,1]
[null,null,"TRACKLINK INTERACTIVO 60",25.741333333333337,1208.48,null,2022,null,1.1200000000000001,null,"IBARRA",null,null,"MAYO",null,null,"CAFÉ",null,5,null,null,null,null,null,null,null,null,null,null,"BUICK",81,"ALFA ROMEO",24,166,5,"SEDAN",null,5,"UNIÓN LIBRE",25,{"$f":"AO90+12","v":60},null,null,null,"CHINA",null,null,null,null,null,null,362620,1]
[null,null,"TRACKLINK CONTROL 12",54.04,388.64,419,null,null,44.8,null,"MANTA",null,null,"JUNIO",null,null,"CELESTE",null,6,null,null,null,null,null,null,null,null,null,null,"CHANGAN",83,"ALFA ROMEO",24,"SPIDER",6,"SEDAN",null,6,null,30,null,null,null,"tipo de cliente","CHILE",null,null,null,null,null,null,362621,1]
[null,null,"TRACKLINK CONTROL 24",39.620000000000005,511.84,null,null,null,{"$f":"IF(F11>4000,F11-4000,44.8)","v":44.8},null,"PORTOVIEJO",null,null,"JULIO",null,null,"CREMA",null,7,null,null,null,null,null,null,null,null,null,null,"CHEVROLET",3,"ALFA ROMEO",24,33,7,"SEDAN",null,7,null,35,null,null,null,"PERSONAL","COLOMBIA",null,null,null,null,null,null,362622,16]
[null,null,"TRACKLINK CONTROL 36",34.81333333333334,635.04,null,null,null,22.4,null,"MACHALA",null,null,"AGOSTO",null,null,"FUCSIA",null,8,null,null,null,null,null,null,null,null,null,null,"CHRYSLER",4,"ALFA ROMEO",24,"GIO",8,"SEDAN",null,8,null,40,null,null,null,null,"ECUADOR",null,null,null,null,null,null,363999,16]
[null,null,"TRACKLINK CONTROL 48",32.410000000000004,881.44,null,null,null,56,null,"LOJA",null,null,"SEPTIEMBRE",null,null,"GRIS",null,9,"TIPO DE VEHÍCLO",null,null,null,null,null,null,null,null,null,"CITROEN",28,"ALFA ROMEO",24,164,9,"SEDAN",null,9,null,45,null,null,null,null,"ESPAÑA",null,null,null,null,null,null,364170,16]
[null,null,"TRACKLINK CONTROL 60",30.968000000000004,1127.8399999999999,{"$f":"+E91/48","v":25.176666666666666},null,null,null,null,"ALAMOR",null,null,"OCTUBRE",null,null,"LILA",null,10,"LIVIANO",null,null,null,null,null,null,null,null,null,"DACIA",29,"ALFA ROMEO",24,"GTV3",10,"SEDAN",null,10,null,50,null,null,null,null,"ESTADOS UNIDOS",null,null,null,null,null,null,364171,1]
[null,null,"TRACKLINK CONTROL PLUS 12",69.90666666666668,586.88,{"$f":"+(E92*1.05)","v":408.072},null,null,null,null,"ALAUSI",null,null,"NOVIEMBRE",null,null,"MORADO",null,11,"PESADO HASTA 7.5 TN",null,null,null,null,null,null,null,null,null,"DAEWOO",5,"ALFA ROMEO",24,145,11,"COUPE",null,11,null,55,null,null,null,null,"NORUEGA",null,null,null,null,null,null,364172,16]
[null,null,"TRACKLINK CONTROL PLUS 24",47.506666666666668,736.96,null,null,null,null,null,"AMBUQUI",null,null,"DICIEMBRE",null,null,"NARANJA",null,12,null,null,null,null,null,null,null,null,null,null,"DAIHATSU",6,"ALFA ROMEO",24,147,12,"SEDAN",null,12,null,60,null,null,null,null,"HONG KONG",null,null,null,null,null,null,364173,1]
[null,null,"TRACKLINK CONTROL PLUS 36",40.04,887.04,null,null,null,null,null,"ANTONIO ANTE",null,null,null,null,null,"NEGRO",null,13,null,null,null,null,null,null,null,null,null,null,"DATSUN",30,"AUDI",1,80,1,"SEDAN",null,13,null,65,null,null,null,null,"FRANCIA",null,null,null,null,null,null,364190,16]
[null,null,"TRACKLINK CONTROL PLUS 48",36.306666666666672,1187.2,null,null,null,null,null,"ANTONIO ANTE",null,null,null,null,null,"PLATA",null,14,null,null,null,null,null,null,null,null,null,null,"DEER",111,"AUDI",1,"A3",2,"SEDAN",null,14,null,70,null,null,null,null,"INGLATERRA",null,null,null,null,null,null,364234,16]
[null,null,"TRACKLINK CONTROL PLUS 60",34.06666666666667,1487.36,{"$f":"+E96/48","v":23.496666666666666},null,null,null,null,"ARCHIDONA",null,null,null,null,null,"PLATEADO",null,15,null,null,null,null,null,null,null,null,null,null,"DODGE",31,"AUDI",1,"TT COUPE 1.8 QUATTRO",3,"SEDAN",null,15,null,75,null,null,null,null,"ITALIA",null,null,null,null,null,null,364261,16]
[null,null,"TRACKLINK CONTROL TOTAL 12",88.573333333333338,null,null,null,null,null,null,"ARENILLAS",null,null,null,null,null,"PLOMO",null,16,null,null,null,null,null,null,null,null,null,null,"FIAT",7,"AUDI",1,"A4",4,"SEDAN",null,16,null,80,null,null,null,null,"JAPÓN",null,null,null,null,null,null,364444,1]
[null,null,"TRACKLINK CONTROL TOTAL 24",60.153333333333336,null,null,null,null,null,null,"ATACAMES",null,null,null,null,null,"ROJO",null,17,null,null,null,null,null,null,null,null,null,null,"FORD",8,"AUDI",1,"A6",5,"SEDAN",null,17,null,85,null,null,null,null,"COREA",null,null,null,null,null,null,364522,16]
[null,null,"TRACKLINK CONTROL TOTAL 36",50.680000000000007,null,null,null,null,null,null,"ATUNTAQUI",null,null,null,null,null,"VERDE",null,18,null,null,null,null,null,null,null,null,null,null,"FSO",77,"AUDI",1,808,6,"SEDAN",null,18,null,90,null,null,null,null,"MÉXICO",null,null,null,null,null,null,364700,1]
[null,null,"TRACKLINK CONTROL TOTAL 48",45.943333333333335,null,null,null,null,null,null,"AZOGUEZ",null,null,null,null,null,"VINO",null,19,null,null,null,null,null,null,null,null,null,null,"GMC",70,"AUDI",1,"A 62.8",7,"SEDAN",null,19,null,95,null,null,null,null,"PERU",null,null,null,null,null,null,364701,16]
[null,null,"TRACKLINK CONTROL TOTAL 60",43.101333333333336,null,null,null,null,null,null,"BABAHOYO",null,null,null,null,null,"BRONCE",null,20,null,null,null,null,null,null,null,null,null,null,"GREAT WALL",108,"AUDI",1,"ALLROAD",8,"SEDAN",null,20,null,100,null,null,null,null,"REPUBLICA CHECA",null,null,null,null,null,null,364702,16]
[null,null,"SHERLOC 12",53.2,null,{"$f":"+(E102*1.05)","v":0},null,null,870,null,"BAHÍA DE CARÁQUEZ",null,null,null,null,null,"CHAMPAGNE",null,21,null,null,null,null,null,null,null,null,null,null,"HONDA",9,"AUDI",1,"A8",9,"SEDAN",null,21,null,null,null,null,null,null,"RUSIA",null,null,null,null,null,null,364703,1]
[null,null,"SHERLOC 24",40.549999999999997,null,null,null,null,null,null,"BALAO",null,null,null,null,null,"DORADO",null,22,null,null,null,null,null,null,null,null,null,null,"HUMMER",115,"AUSTIN",26,"MINI 1000",1,"COUPE",null,22,null,null,null,null,null,null,"SUECIA",null,null,null,null,null,null,364716,1]
[null,null,"SHERLOC 36",36.340000000000003,null,null,null,null,null,null,"BALSAS",null,null,null,null,null,"HABANO",null,23,null,null,null,null,null,null,null,null,null,null,"HYUNDAI",10,"AUSTIN",26,"MINI CORD",2,"COUPE",null,23,null,null,null,null,null,null,"VENEZUELA",null,null,null,null,null,null,364717,1]
[null,null,"SHERLOC 48",31.9,null,null,null,null,null,null,"BALZAR",null,null,null,null,null,"MARRÓN",null,24,null,null,null,null,null,null,null,null,null,null,"INTERNATIONAL",44,"BMW",2,318,1,"SEDAN",null,24,null,null,null,null,null,null,"YUGOSLAVIA",null,null,null,null,null,null,364719,16]
[null,null,"SHERLOC 60",29.23,null,{"$f":"+E106/48","v":0},null,null,null,null,"BAÑOS",null,null,null,null,null,"STRATO",null,25,null,null,null,null,null,null,null,null,null,null,"ISUZU",34,"BMW",2,"330I",2,"SEDAN",null,25,null,null,null,null,null,null,null,null,null,null,null,null,null,365001,16]
[null,null,"HUNTER LOJACK 12",41.887999999999998,null,null,null,null,null,null,"BIBLIAN",null,null,null,null,null,"VIOLETA",null,26,null,null,null,null,null,null,null,null,null,null,"JAGUAR",35,"BMW",2,"328I",3,"SEDAN",null,26,null,null,null,null,null,null,null,null,null,null,null,null,null,365147,16]
[null,null,"HUNTER LOJACK 24",33.6,null,null,null,null,null,null,"BOLÍVAR",null,null,null,null,null,"TURQUESA",null,27,null,null,null,null,null,null,null,null,null,null,"JEEP",71,"BMW",2,"325I",4,"SEDAN",null,27,null,null,null,null,null,null,null,null,null,null,null,null,null,365166,1]
[null,null,"HUNTER LOJACK 36",30.24,null,null,null,null,null,null,"BUENA FE",null,null,null,null,null,"ROSADO",null,28,null,null,null,null,null,null,null,null,null,null,"KIA",11,"BMW",2,"X5 4X4 5P",5,"JEEP",null,28,null,null,null,null,null,null,null,null,null,null,null,null,null,365167,1]
[null,null,"HUNTER LOJACK 48",29.12,null,null,null,null,null,null,"CALUMA",null,null,null,null,null,"ARENA",null,29,null,null,null,null,null,null,null,null,null,null,"LADA",13,"BMW",2,"528I",6,"SEDAN",null,29,null,null,null,null,null,null,null,null,null,null,null,null,null,365168,16]
[null,null,"HUNTER LOJACK 60",28,null,null,null,null,null,null,"CAÑAR",null,null,null,null,null,"ILUSIÓN",null,30,null,null,null,null,null,null,null,null,null,null,"LANCIA",36,"BMW",2,"316I",7,"SEDAN",null,30,null,null,null,null,null,null,null,null,null,null,null,null,null,365169,1]
[null,null,"H. MONITOREO BASICO 12",{"$f":"632.5/12","v":52.708333333333336},null,null,null,null,null,null,"CARIAMANGA",null,null,null,null,null,"ROBLE",null,31,null,null,null,null,null,null,null,null,null,null,"LAND ROVER",12,"BMW",2,"320I",8,"SEDAN",null,31,null,null,null,null,null,null,null,null,null,null,null,null,null,365181,1]
[null,null,"H. MONITOREO BASICO 24",{"$f":"977.5/24","v":40.729166666666664},null,null,null,null,null,null,"CATAMAYO",null,null,null,null,null,"MOSTAZA",null,32,null,null,null,null,null,null,null,null,null,null,"LEXUS",37,"BMW",2,"323I",9,"SEDAN",null,null,null,null,null,null,null,null,null,null,null,null,null,null,null,365420,1]
[null,null,"H. MONITOREO BASICO 36",{"$f":"1322.5/36","v":36.736111111111114},null,null,null,null,null,null,"CAYAMBE",null,null,null,null,null,null,null,null,null,null,null,null,null,null,null,null,null,null,"LINCOLN",38,"BMW",2,"523I",10,"SEDAN",null,null,null,null,null,null,null,null,null,null,null,null,null,null,null,365421,16]
[null,null,"H. MONITOREO BASICO 48",{"$f":"1667.5/48","v":34.739583333333336},null,null,null,null,null,null,"CELICA",null,null,null,null,null,null,null,null,null,null,null,null,null,null,null,null,null,null,"MAHINDRA",101,"BMW",2,"525I",11,"SEDAN",null,null,null,null,null,null,null,null,null,null,null,null,null,null,null,365422,1]
[null,null,"H. MONITOREO BASICO 60",{"$f":"2012.5/60","v":33.541666666666664},null,null,null,null,null,null,"CHICA",null,null,null,null,null,null,null,null,null,null,null,null,null,null,null,null,null,null,"MAZDA",14,"BMW",2,"Z3",12,"COUPE",null,null,null,null,null,null,null,null,null,null,null,null,null,null,null,365423,16]
[null,null,"H. MONITOREO BÁSICO GOLDEN 12",{"$f":"788.98/12","v":65.748333333333335},null,null,null,null,null,null,"CHIMBO",null,null,null,null,null,null,null,null,null,null,null,null,null,null,null,null,null,null,"MERCEDES BENZ",15,"BMW",2,"Z8",13,"COUPE",null,null,null,null,null,null,null,null,null,null,null,null,null,null,null,365424,16]
[null,null,"H. MONITOREO BÁSICO GOLDEN 24",{"$f":"1133.98/24","v":47.249166666666667},null,null,null,null,null,null,"CHONE",null,null,null,null,null,null,null,null,null,null,null,null,null,null,null,null,null,null,"MITSUBISHI",16,"BMW",2,"M3",14,"COUPE",null,null,null,null,null,null,null,null,null,null,null,null,null,null,null,365425,1]
[null,null,"H. MONITOREO BÁSICO GOLDEN 36",{"$f":"1478.98/36","v":41.082777777777778},null,null,null,null,null,null,"COCA",null,null,null,null,null,null,null,null,null,null,null,null,null,null,null,null,null,null,"NISSAN",17,"BMW",2,"M5",15,"COUPE",null,null,null,null,null,null,null,null,null,null,null,null,null,null,null,365427,1]
[null,null,"H. MONITOREO BÁSICO GOLDEN 48",{"$f":"1823.98/48","v":37.999583333333334},null,null,null,null,null,null,"CONCORDIA",null,null,null,null,null,null,null,null,null,null,null,null,null,null,null,null,null,null,"OLDSMOBIL",73,"BMW",2,520,16,"SEDAN",null,null,null,null,null,null,null,null,null,null,null,null,null,null,null,365428,1]
[null,null,"H. MONITOREO BÁSICO GOLDEN 60",{"$f":"2168.98/60","v":36.149666666666668},null,null,null,null,null,null,"COTACACHI",null,null,null,null,null,null,null,null,null,null,null,null,null,null,null,null,null,null,"OLTCIT",40,"BMW",2,"530IA",17,"SEDAN",null,null,null,null,null,null,null,null,null,null,null,null,null,null,null,365429,16]
[null,null,"MARESA SATELITAL BY HUNTER 12",{"$f":"616/12","v":51.333333333333336},null,null,null,null,null,null,"CUMBAYÁ",null,null,null,null,null,null,null,null,null,null,null,null,null,null,null,null,null,null,"PEUGEOT",18,"BMW",2,"318TI",18,"COUPE",null,null,null,null,null,null,null,null,null,null,null,null,null,null,null,365453,16]
[null,null,"MARESA SATELITAL BY HUNTER 24",{"$f":"968.8/24","v":40.366666666666667},null,null,null,null,null,null,"DAULE",null,null,null,null,null,null,null,null,null,null,null,null,null,null,null,null,null,null,"PLYMOUTH",54,"BMW",2,740,19,"SEDAN",null,null,null,null,null,null,null,null,null,null,null,null,null,null,null,365454,16]
[null,null,"MARESA SATELITAL BY HUNTER 36",{"$f":"1338.4/36","v":37.177777777777777},null,null,null,null,null,null,"DURAN",null,null,null,null,null,null,null,null,null,null,null,null,null,null,null,null,null,null,"PORCHE",56,"BMW",2,1602,21,"SEDAN"]
[null,null,"MARESA SATELITAL BY HUNTER 48",{"$f":"1708/48","v":35.583333333333336},null,null,null,null,null,null,"EL ÁNGEL",null,null,null,null,null,null,null,null,null,null,null,null,null,null,null,null,null,null,"RENAULT",19,"BMW",2,366,22,"SEDAN"]
[null,null,"MARESA SATELITAL BY HUNTER 60",{"$f":"2077.6/60","v":34.626666666666665},null,null,null,null,null,null,"EL CARMEN",null,null,null,null,null,null,null,null,null,null,null,null,null,null,null,null,null,null,"SAAB",45,"BMW",2,530,23,"SEDAN"]
[null,null,null,null,null,null,null,null,null,null,"EL CORAZÓN",null,null,null,null,null,null,null,null,null,null,null,null,null,null,null,null,null,null,"SAEHAN",57,"BMW",2,540,25,"SEDAN"]
[null,null,null,null,null,null,null,null,null,null,"EL EMPALME",null,null,null,null,null,null,null,null,null,null,null,null,null,null,null,null,null,null,"SAMSUNG",74,"BMW",2,"318IS",26,"SEDAN"]
[null,null,null,null,null,null,null,null,null,null,"EL GUABO",null,null,null,null,null,null,null,null,null,null,null,null,null,null,null,null,null,null,"SANGYONG",42,"BMW",2,"318I LIMUSIN",27,"SEDAN"]
[null,null,null,null,null,null,null,null,null,null,"EL NARANJAL",null,null,null,null,null,null,null,null,null,null,null,null,null,null,null,null,null,null,"SEAT",105,"BMW",2,"Z4",29,"COUPE"]
[null,null,"Con dispositivo Concesionario",null,null,null,null,null,null,null,"EL TAMBO",null,null,null,null,null,null,null,null,null,null,null,null,null,null,null,null,null,null,"SKODA",20,"BMW",2,"X3",31,"JEEP"]
[null,null,"H. MONITOREO BASICO",null,null,null,null,null,null,null,"EL TRIUNFO",null,null,null,null,null,null,null,null,null,null,null,null,null,null,null,null,null,null,"SUBARU",58,"BUICK",81,"CENTURY",1,"SEDAN"]
[null,null,"H. MONITOREO BÁSICO GOLDEN",null,null,null,null,null,null,null,"ESMERALDAS",null,null,null,null,null,null,null,null,null,null,null,null,null,null,null,null,null,null,"SUZUKI",60,"CHANGAN",83,"SC1011CG",1,"PICK-UP"]
[null,null,"Con dispositivo Concesionario",null,null,null,null,null,null,null,"FLAVIO ALFARO",null,null,null,null,null,null,null,null,null,null,null,null,null,null,null,null,null,null,"TALBOT",59,"CHANGAN",83,"MINI VAN",2,"MINI VAN"]
[null,null,null,null,null,null,null,null,null,null,"GIRÓN",null,null,null,null,null,null,null,null,null,null,null,null,null,null,null,null,null,null,"TATA",75,"CHANGAN",83,"SC1018AA100",3,"PICK-UP"]
[null,null,null,null,null,null,null,null,null,null,"GONZALO PIZARRO",null,null,null,null,null,null,null,null,null,null,null,null,null,null,null,null,null,null,"TOYOTA",21,"CHEVROLET",3,"FORSA",1,"COUPE"]
[null,null,null,null,null,null,null,null,null,null,"GUALACEO",null,null,null,null,null,null,null,null,null,null,null,null,null,null,null,null,null,null,"VOLKSWAGEN",22,"CHEVROLET",3,"CORSA 3P",2,"COUPE"]
[]
[]
[null,null,null,null,null,null,null,null,null,null,"GUALAQUIZA",null,null,null,null,null,null,null,null,null,null,null,null,null,null,null,null,null,null,"VOLVO",23,"CHEVROLET",3,"CORSA 4P",3,"SEDAN"]
[null,null,null,null,null,null,null,null,null,null,"GUAMOTE",null,null,null,null,null,null,null,null,null,null,null,null,null,null,null,null,null,null,"WORLDSTAR",99,"CHEVROLET",3,"CORSA 5P",4,"SEDAN"]
[null,null,null,null,null,null,null,null,null,null,"GUANO",null,null,null,null,null,null,null,null,null,null,null,null,null,null,null,null,null,null,"ZASTAVA",61,"CHEVROLET",3,"CORSA SPORT",5,"SEDAN"]
[null,null,null,null,null,null,null,null,null,null,"GUARANDA",null,null,null,null,null,null,null,null,null,null,null,null,null,null,null,null,null,null,null,null,"CHEVROLET",3,"CORSA P/U 1600",6,"PICK-UP"]
[null,null,null,null,null,null,null,null,null,null,"GUAYLLABAMBA",null,null,null,null,null,null,null,null,null,null,null,null,null,null,null,null,null,null,null,null,"CHEVROLET",3,"SAN REMO",7,"SEDAN"]
[null,null,null,null,null,null,null,null,null,null,"HUAQUILLAS",null,null,null,null,null,null,null,null,null,null,null,null,null,null,null,null,null,null,null,null,"CHEVROLET",3,"MONZA",8,"SEDAN"]
[null,null,null,null,null,null,null,null,null,null,"JIPIJAPA",null,null,null,null,null,null,null,null,null,null,null,null,null,null,null,null,null,null,null,null,"CHEVROLET",3,"SWIFT",9,"SEDAN"]
[null,null,null,null,null,null,null,null,null,null,"JUNIN",null,null,null,null,null,null,null,null,null,null,null,null,null,null,null,null,null,null,null,null,"CHEVROLET",3,"SWIFT EMOTION",10,"SEDAN"]
[null,null,null,null,null,null,null,null,null,null,"LA CONCORDIA",null,null,null,null,null,null,null,null,null,null,null,null,null,null,null,null,null,null,null,null,"CHEVROLET",3,"ESTEEM 4P",11,"SEDAN"]
[null,null,null,null,null,null,null,null,null,null,"LA MANA",null,null,null,null,null,null,null,null,null,null,null,null,null,null,null,null,null,null,null,null,"CHEVROLET",3,"ESTEEM S. WAGON",12,"STATION WAGON"]
[null,null,null,null,null,null,null,null,null,null,"LA UNIÓN",null,null,null,null,null,null,null,null,null,null,null,null,null,null,null,null,null,null,null,null,"CHEVROLET",3,"LUV 4X2 C/S",13,"PICK-UP"]
[null,null,null,null,null,null,null,null,null,null,"LAGO AGRIO",null,null,null,null,null,null,null,null,null,null,null,null,null,null,null,null,null,null,null,null,"CHEVROLET",3,"LUV 4X2 D/C",14,"PICK-UP"]
[null,null,null,null,null,null,null,null,null,null,"LAS LAJAS",null,null,null,null,null,null,null,null,null,null,null,null,null,null,null,null,null,null,null,null,"CHEVROLET",3,"LUV 4X4 C/S",15,"PICK-UP"]
[null,null,"Valor del vehículo",{"$f":"+$F$34","v":10000},null,null,null,null,null,null,"LASSO",null,null,null,null,null,null,null,null,null,null,null,null,null,null,null,null,null,null,null,null,"CHEVROLET",3,"LUV 4X4 D/C",16,"PICK-UP"]
[null,null,"INSCRIPCIÓN EN REGISTRO MERCANTIL",null,null,null,null,null,null,null,"LATACUNGA",null,null,null,null,null,null,null,null,null,null,null,null,null,null,null,null,null,null,null,null,"CHEVROLET",3,"VITARA 3P",17,"JEEP"]
[null,null,"VALOR BASE POR CONTRATO",25,null,null,null,null,null,null,"LIBERTAD",null,null,null,null,null,null,null,null,null,null,null,null,null,null,null,null,null,null,null,null,"CHEVROLET",3,"VITARA 5P",18,"JEEP"]
[null,null,"CESIÓN DE DERECHOS",30,null,null,null,null,null,null,"LIMÓN",null,null,null,null,null,null,null,null,null,null,null,null,null,null,null,null,null,null,null,null,"CHEVROLET",3,"RODEO 4X2",19,"JEEP"]
[null,null,"0.5% SOBRE LA CUANTÍA DEL CONTRATO (PRECIO DE VENTA).",{"$f":"D158*0.5%","v":50},null,null,null,null,null,null,"QUEVEDO",null,null,null,null,null,null,null,null,null,null,null,null,null,null,null,null,null,null,null,null,"CHEVROLET",3,"RODEO 4X4",20,"JEEP"]
[null,null,"TOTAL",{"$f":"SUM(D160:D162)","v":105},null,null,null,null,null,null,"LOS BANCOS",null,null,null,null,null,null,null,null,null,null,null,null,null,null,null,null,null,null,null,null,"CHEVROLET",3,"CAVALIER STD",21,"SEDAN"]
[null,null,"OTROS GASTOS",null,null,null,null,null,null,null,"MACARA",null,null,null,null,null,null,null,null,null,null,null,null,null,null,null,null,null,null,null,null,"CHEVROLET",3,"CAVALIER DLX",22,"SEDAN"]
[null,null,"TRAMITACIÓN LEGAL, SERVICIO DE TERCERO",{"$f":"162.4+30","v":192.4},null,null,null,null,null,null,"MACAS",null,null,null,null,null,null,null,null,null,null,null,null,null,null,null,null,null,null,null,null,"CHEVROLET",3,"SÚPER CARRY PICK UP",23,"PICK-UP"]
[null,null,null,null,null,null,null,null,null,null,"MACHACHI",null,null,null,null,null,null,null,null,null,null,null,null,null,null,null,null,null,null,null,null,"CHEVROLET",3,"GRAND BLAZER 3P",26,"JEEP"]
[null,null,"Tarifa gastos legales",{"$f":"+D163+D165","v":297.39999999999998},null,null,null,null,null,null,"MÉNDEZ",null,null,null,null,null,null,null,null,null,null,null,null,null,null,null,null,null,null,null,null,"CHEVROLET",3,"GRAND BLAZER 5P",27,"JEEP"]
[null,null,null,null,null,null,null,null,null,null,"MILAGRO",null,null,null,null,null,null,null,null,null,null,null,null,null,null,null,null,null,null,null,null,"CHEVROLET",3,"TAHOE 5P. USA",28,"JEEP"]
[null,null,null,null,null,null,null,null,null,null,"MIRA",null,null,null,null,null,null,null,null,null,null,null,null,null,null,null,null,null,null,null,null,"CHEVROLET",3,"BLAZER 4X4",29,"JEEP"]
[null,null,null,null,null,null,null,null,null,null,"MOCACHE",null,null,null,null,null,null,null,null,null,null,null,null,null,null,null,null,null,null,null,null,"CHEVROLET",3,"BLAZER 4X2",30,"JEEP"]
[null,null,"Declaración unico vehículo",null,null,null,null,null,null,null,"MONTALVO",null,null,null,null,null,null,null,null,null,null,null,null,null,null,null,null,null,null,null,null,"CHEVROLET",3,"SILVERADO",31,"PICK-UP"]
[null,null,"Si",null,null,null,null,null,null,null,"MONTECRISTI",null,null,null,null,null,null,null,null,null,null,null,null,null,null,null,null,null,null,null,null,"CHEVROLET",3,"CHEYENNE",32,"PICK-UP"]
[null,null,"No",null,null,null,null,null,null,null,"MONTUFAR",null,null,null,null,null,null,null,null,null,null,null,null,null,null,null,null,null,null,null,null,"CHEVROLET",3,"TROOPER 2.300 3P.",33,"JEEP"]
[null,null,null,null,null,null,null,null,null,null,"MUISNE",null,null,null,null,null,null,null,null,null,null,null,null,null,null,null,null,null,null,null,null,"CHEVROLET",3,"TROOPER 3P",34,"JEEP"]
[null,null,null,null,null,null,null,null,null,null,"NARANJITO",null,null,null,null,null,null,null,null,null,null,null,null,null,null,null,null,null,null,null,null,"CHEVROLET",3,"TROOPER 5P",35,"JEEP"]
[null,null,null,null,null,null,null,null,null,null,"NUEVA LOJA",null,null,null,null,null,null,null,null,null,null,null,null,null,null,null,null,null,null,null,null,"CHEVROLET",3,"GRAND VITARA 3P",36,"JEEP"]
[null,null,null,null,null,null,null,null,null,null,"OTAVALO",null,null,null,null,null,null,null,null,null,null,null,null,null,null,null,null,null,null,null,null,"CHEVROLET",3,"GRAND VITARA 5P",37,"JEEP"]
[null,null,null,null,null,null,null,null,null,null,"PAJAN",null,null,null,null,null,null,null,null,null,null,null,null,null,null,null,null,null,null,null,null,"CHEVROLET",3,"ALTO 5P",38,"SEDAN"]
[null,null,null,null,null,null,null,null,null,null,"PALENQUE",null,null,null,null,null,null,null,null,null,null,null,null,null,null,null,null,null,null,null,null,"CHEVROLET",3,"ASTRA 2P",39,"COUPE"]
[null,null,null,null,null,null,null,null,null,null,"PALESTINA",null,null,null,null,null,null,null,null,null,null,null,null,null,null,null,null,null,null,null,null,"CHEVROLET",3,"ASTRA 4P",40,"SEDAN"]
[null,null,null,null,null,null,null,null,null,null,"PALLATANGA",null,null,null,null,null,null,null,null,null,null,null,null,null,null,null,null,null,null,null,null,"CHEVROLET",3,"ASKA",41,"SEDAN"]
[null,null,null,null,null,null,null,null,null,null,"PASAJE",null,null,null,null,null,null,null,null,null,null,null,null,null,null,null,null,null,null,null,null,"CHEVROLET",3,"ASTROVAN",42,"MINI VAN"]
[null,null,null,null,null,null,null,null,null,null,"PASTAZA",null,null,null,null,null,null,null,null,null,null,null,null,null,null,null,null,null,null,null,null,"CHEVROLET",3,"CHEVETTE",44,"COUPE"]
[null,null,null,null,null,null,null,null,null,null,"PATATE",null,null,null,null,null,null,null,null,null,null,null,null,null,null,null,null,null,null,null,null,"CHEVROLET",3,"CONDOR",45,"COUPE"]
[null,null,null,null,null,null,null,null,null,null,"PAUTE",null,null,null,null,null,null,null,null,null,null,null,null,null,null,null,null,null,null,null,null,"CHEVROLET",3,"CORSICA",46,"SEDAN"]
[null,null,null,null,null,null,null,null,null,null,"PEDERNALES",null,null,null,null,null,null,null,null,null,null,null,null,null,null,null,null,null,null,null,null,"CHEVROLET",3,"GEMINI",47,"SEDAN"]
[null,null,null,null,null,null,null,null,null,null,"PEDRO CARBO",null,null,null,null,null,null,null,null,null,null,null,null,null,null,null,null,null,null,null,null,"CHEVROLET",3,"IMPALA",48,"SEDAN"]
[null,null,null,null,null,null,null,null,null,null,"PELILEO",null,null,null,null,null,null,null,null,null,null,null,null,null,null,null,null,null,null,null,null,"CHEVROLET",3,"VEGA",49,"SEDAN"]
[null,null,null,null,null,null,null,null,null,null,"PIFO",null,null,null,null,null,null,null,null,null,null,null,null,null,null,null,null,null,null,null,null,"CHEVROLET",3,"ZAFIRA 5P",51,"MINI VAN"]
[null,null,null,null,null,null,null,null,null,null,"PILLARO",null,null,null,null,null,null,null,null,null,null,null,null,null,null,null,null,null,null,null,null,"CHEVROLET",3,"CARGO",52,"PICK-UP"]
[null,null,null,null,null,null,null,null,null,null,"PIMAMPIRO",null,null,null,null,null,null,null,null,null,null,null,null,null,null,null,null,null,null,null,null,"CHEVROLET",3,"CHEVY VAN",53,"MINI VAN"]
[null,null,null,null,null,null,null,null,null,null,"PINDAL",null,null,null,null,null,null,null,null,null,null,null,null,null,null,null,null,null,null,null,null,"CHEVROLET",3,"MINI BLAZER 4X2",55,"JEEP"]
[null,null,null,null,null,null,null,null,null,null,"PIÑAS",null,null,null,null,null,null,null,null,null,null,null,null,null,null,null,null,null,null,null,null,"CHEVROLET",3,"MINI BLAZER 4X4",56,"JEEP"]
[null,null,null,null,null,null,null,null,null,null,"PLAYAS",null,null,null,null,null,null,null,null,null,null,null,null,null,null,null,null,null,null,null,null,"CHEVROLET",3,"CITATION",57,"SEDAN"]
[null,null,null,null,null,null,null,null,null,null,"PORTOVELO",null,null,null,null,null,null,null,null,null,null,null,null,null,null,null,null,null,null,null,null,"CHEVROLET",3,"C10",60,"PICK-UP"]
[null,null,null,null,null,null,null,null,null,null,"PUEBLO VIEJO",null,null,null,null,null,null,null,null,null,null,null,null,null,null,null,null,null,null,null,null,"CHEVROLET",3,"CREW CAB 4X4",65,"PICK-UP"]
[null,null,null,null,null,null,null,null,null,null,"PUEMBO",null,null,null,null,null,null,null,null,null,null,null,null,null,null,null,null,null,null,null,null,"CHEVROLET",3,"C1500",66,"PICK-UP"]
[null,null,null,null,null,null,null,null,null,null,"PUERTO CAYO",null,null,null,null,null,null,null,null,null,null,null,null,null,null,null,null,null,null,null,null,"CHEVROLET",3,"AVALANCHE",68,"PICK-UP"]
[null,null,null,null,null,null,null,null,null,null,"PUERTO LOPEZ",null,null,null,null,null,null,null,null,null,null,null,null,null,null,null,null,null,null,null,null,"CHEVROLET",3,"CORSA EVOLUTION",70,"SEDAN"]
[null,null,null,null,null,null,null,null,null,null,"PUERTO QUITO",null,null,null,null,null,null,null,null,null,null,null,null,null,null,null,null,null,null,null,null,"CHEVROLET",3,"TRAIL BLAZER 4X4",71,"JEEP"]
[null,null,null,null,null,null,null,null,null,null,"PUJILI",null,null,null,null,null,null,null,null,null,null,null,null,null,null,null,null,null,null,null,null,"CHEVROLET",3,"TRAIL BLAZER 4X2",72,"JEEP"]
[null,null,null,null,null,null,null,null,null,null,"PUYANGO",null,null,null,null,null,null,null,null,null,null,null,null,null,null,null,null,null,null,null,null,"CHEVROLET",3,"ASTRA 3P",73,"COUPE"]
[null,null,null,null,null,null,null,null,null,null,"PUYO",null,null,null,null,null,null,null,null,null,null,null,null,null,null,null,null,null,null,null,null,"CHEVROLET",3,"CORSA WIND",74,"SEDAN"]
[null,null,null,null,null,null,null,null,null,null,"QUERO",null,null,null,null,null,null,null,null,null,null,null,null,null,null,null,null,null,null,null,null,"CHEVROLET",3,"JIMNY 4X4",75,"JEEP"]
[null,null,null,null,null,null,null,null,null,null,"QUININDE",null,null,null,null,null,null,null,null,null,null,null,null,null,null,null,null,null,null,null,null,"CHEVROLET",3,"SPARK",76,"SEDAN"]
[null,null,null,null,null,null,null,null,null,null,"QUITO",null,null,null,null,null,null,null,null,null,null,null,null,null,null,null,null,null,null,null,null,"CHEVROLET",3,"CHEYENNE 4X2",77,"PICK-UP"]
[null,null,null,null,null,null,null,null,null,null,"RIOBAMBA",null,null,null,null,null,null,null,null,null,null,null,null,null,null,null,null,null,null,null,null,"CHEVROLET",3,"CHEYENNE 4X4",78,"PICK-UP"]
[null,null,null,null,null,null,null,null,null,null,"ROCAFUERTE",null,null,null,null,null,null,null,null,null,null,null,null,null,null,null,null,null,null,null,null,"CHEVROLET",3,"OPTRA",79,"SEDAN"]
[null,null,null,null,null,null,null,null,null,null,"SALCEDO",null,null,null,null,null,null,null,null,null,null,null,null,null,null,null,null,null,null,null,null,"CHEVROLET",3,"GRAND VITARA 5P XL7 4X4",80,"JEEP"]
[null,null,null,null,null,null,null,null,null,null,"SALINAS",null,null,null,null,null,null,null,null,null,null,null,null,null,null,null,null,null,null,null,null,"CHEVROLET",3,"GRAND VITARA 5P XL7 4X2",81,"JEEP"]
[null,null,null,null,null,null,null,null,null,null,"SAMBORONDON",null,null,null,null,null,null,null,null,null,null,null,null,null,null,null,null,null,null,null,null,"CHEVROLET",3,"LUV D-MAX C/S 4X2",82,"PICK-UP"]
[null,null,null,null,null,null,null,null,null,null,"SAME",null,null,null,null,null,null,null,null,null,null,null,null,null,null,null,null,null,null,null,null,"CHEVROLET",3,"LUV D-MAX C/D 4X2",83,"PICK-UP"]
[null,null,null,null,null,null,null,null,null,null,"SAN CAMILO",null,null,null,null,null,null,null,null,null,null,null,null,null,null,null,null,null,null,null,null,"CHEVROLET",3,"LUV D-MAX C/S 4X4",84,"PICK-UP"]
[null,null,null,null,null,null,null,null,null,null,"SAN GABRIEL",null,null,null,null,null,null,null,null,null,null,null,null,null,null,null,null,null,null,null,null,"CHEVROLET",3,"LUV D-MAX C/D 4X4",85,"PICK-UP"]
[null,null,null,null,null,null,null,null,null,null,"SAN LORENZO",null,null,null,null,null,null,null,null,null,null,null,null,null,null,null,null,null,null,null,null,"CHRYSLER",4,"GRAND CHEROKEE LAREDO 4X4",1,"JEEP"]
[null,null,null,null,null,null,null,null,null,null,"SAN MIGUEL",null,null,null,null,null,null,null,null,null,null,null,null,null,null,null,null,null,null,null,null,"CHRYSLER",4,"GRAND CHEROKEE LIMITED 4X4",2,"JEEP"]
[null,null,null,null,null,null,null,null,null,null,"SAN RAFAEL",null,null,null,null,null,null,null,null,null,null,null,null,null,null,null,null,null,null,null,null,"CHRYSLER",4,"CHEROKEE LAREDO",3,"JEEP"]
[null,null,null,null,null,null,null,null,null,null,"SAN VICENTE",null,null,null,null,null,null,null,null,null,null,null,null,null,null,null,null,null,null,null,null,"CHRYSLER",4,"NEON 2000CC",4,"SEDAN"]
[null,null,null,null,null,null,null,null,null,null,"SANGOLQUI",null,null,null,null,null,null,null,null,null,null,null,null,null,null,null,null,null,null,null,null,"CHRYSLER",4,"CARAVAN",5,"MINI VAN"]
[null,null,null,null,null,null,null,null,null,null,"SANTA ANA",null,null,null,null,null,null,null,null,null,null,null,null,null,null,null,null,null,null,null,null,"CHRYSLER",4,"GRAND CARAVAN",6,"MINI VAN"]
[null,null,null,null,null,null,null,null,null,null,"SANTA CRUZ",null,null,null,null,null,null,null,null,null,null,null,null,null,null,null,null,null,null,null,null,"CHRYSLER",4,"LEBARON",7,"SEDAN"]
[null,null,null,null,null,null,null,null,null,null,"SANTA ELENA",null,null,null,null,null,null,null,null,null,null,null,null,null,null,null,null,null,null,null,null,"CHRYSLER",4,"LIBERTY",8,"JEEP"]
[null,null,null,null,null,null,null,null,null,null,"SANTA ISABEL",null,null,null,null,null,null,null,null,null,null,null,null,null,null,null,null,null,null,null,null,"CHRYSLER",4,"STRATUS",9,"SEDAN"]
[null,null,null,null,null,null,null,null,null,null,"SANTA ISABEL",null,null,null,null,null,null,null,null,null,null,null,null,null,null,null,null,null,null,null,null,"CHRYSLER",4,"RENEGADO",10,"JEEP"]
[null,null,null,null,null,null,null,null,null,null,"SANTA ROSA",null,null,null,null,null,null,null,null,null,null,null,null,null,null,null,null,null,null,null,null,"CHRYSLER",4,"TOWN & COUNTRY",11,"PICK-UP"]
[null,null,null,null,null,null,null,null,null,null,"SANTO DOMINGO",null,null,null,null,null,null,null,null,null,null,null,null,null,null,null,null,null,null,null,null,"CITROEN",28,"AX GT",1,"SEDAN"]
[null,null,null,null,null,null,null,null,null,null,"SAQUISILI",null,null,null,null,null,null,null,null,null,null,null,null,null,null,null,null,null,null,null,null,"CITROEN",28,"BERLINGO",2,"SEDAN"]
[null,null,null,null,null,null,null,null,null,null,"SARAGURO",null,null,null,null,null,null,null,null,null,null,null,null,null,null,null,null,null,null,null,null,"CITROEN",28,"SAXO SX",3,"SEDAN"]
[null,null,null,null,null,null,null,null,null,null,"SHUSHUFINDI",null,null,null,null,null,null,null,null,null,null,null,null,null,null,null,null,null,null,null,null,"CITROEN",28,"XANTIA",4,"SEDAN"]
[null,null,null,null,null,null,null,null,null,null,"SIGCHOS",null,null,null,null,null,null,null,null,null,null,null,null,null,null,null,null,null,null,null,null,"CITROEN",28,"XSARA VTS",5,"SEDAN"]
[null,null,null,null,null,null,null,null,null,null,"SIGSIG",null,null,null,null,null,null,null,null,null,null,null,null,null,null,null,null,null,null,null,null,"CITROEN",28,"ZX VOLCANE",6,"SEDAN"]
[null,null,null,null,null,null,null,null,null,null,"SUCRE",null,null,null,null,null,null,null,null,null,null,null,null,null,null,null,null,null,null,null,null,"CITROEN",28,"ALLUER 5P",7,"STATION WAGON"]
[null,null,null,null,null,null,null,null,null,null,"SUCUA",null,null,null,null,null,null,null,null,null,null,null,null,null,null,null,null,null,null,null,null,"CITROEN",28,"XSARA PICASSO",8,"SEDAN"]
[null,null,null,null,null,null,null,null,null,null,"SUCUMBIOS",null,null,null,null,null,null,null,null,null,null,null,null,null,null,null,null,null,null,null,null,"CITROEN",28,"C3 SX 14I",9,"SEDAN"]
[null,null,null,null,null,null,null,null,null,null,"TABABELA",null,null,null,null,null,null,null,null,null,null,null,null,null,null,null,null,null,null,null,null,"DACIA",29,"1304 DROP-SIDE",1,"PICK-UP"]
[null,null,null,null,null,null,null,null,null,null,"TABACUNDO",null,null,null,null,null,null,null,null,null,null,null,null,null,null,null,null,null,null,null,null,"DACIA",29,"BREAK",2,"SEDAN"]
[null,null,null,null,null,null,null,null,null,null,"TAMBILLO",null,null,null,null,null,null,null,null,null,null,null,null,null,null,null,null,null,null,null,null,"DACIA",29,"RAPSODIE",3,"SEDAN"]
[null,null,null,null,null,null,null,null,null,null,"TENA",null,null,null,null,null,null,null,null,null,null,null,null,null,null,null,null,null,null,null,null,"DAEWOO",5,"TICO 5P. SX",1,"SEDAN"]
[null,null,null,null,null,null,null,null,null,null,"TONSUPA",null,null,null,null,null,null,null,null,null,null,null,null,null,null,null,null,null,null,null,null,"DAEWOO",5,"MATIZ",2,"SEDAN"]
[null,null,null,null,null,null,null,null,null,null,"TOSAGUA",null,null,null,null,null,null,null,null,null,null,null,null,null,null,null,null,null,null,null,null,"DAEWOO",5,"LANOS 4P",3,"SEDAN"]
[null,null,null,null,null,null,null,null,null,null,"TULCAN",null,null,null,null,null,null,null,null,null,null,null,null,null,null,null,null,null,null,null,null,"DAEWOO",5,"LANOS 5P",4,"SEDAN"]
[null,null,null,null,null,null,null,null,null,null,"TUMBACO",null,null,null,null,null,null,null,null,null,null,null,null,null,null,null,null,null,null,null,null,"DAEWOO",5,"LANOS 3P",5,"SEDAN"]
[null,null,null,null,null,null,null,null,null,null,"URCUQUI",null,null,null,null,null,null,null,null,null,null,null,null,null,null,null,null,null,null,null,null,"DAEWOO",5,"NUBIRA",6,"SEDAN"]
[null,null,null,null,null,null,null,null,null,null,"URDANETA",null,null,null,null,null,null,null,null,null,null,null,null,null,null,null,null,null,null,null,null,"DAEWOO",5,"TACUMA",7,"MINI VAN"]
[null,null,null,null,null,null,null,null,null,null,"VENTANAS",null,null,null,null,null,null,null,null,null,null,null,null,null,null,null,null,null,null,null,null,"DAEWOO",5,"ESPERO",8,"SEDAN"]
[null,null,null,null,null,null,null,null,null,null,"VINCES",null,null,null,null,null,null,null,null,null,null,null,null,null,null,null,null,null,null,null,null,"DAEWOO",5,"RACER",9,"SEDAN"]
[null,null,null,null,null,null,null,null,null,null,"YAGUACHI",null,null,null,null,null,null,null,null,null,null,null,null,null,null,null,null,null,null,null,null,"DAEWOO",5,"CIELO",10,"SEDAN"]
[null,null,null,null,null,null,null,null,null,null,"ZAMORA",null,null,null,null,null,null,null,null,null,null,null,null,null,null,null,null,null,null,null,null,"DAEWOO",5,"COACH",11,"SEDAN"]
[null,null,null,null,null,null,null,null,null,null,"ZAPOTILLO",null,null,null,null,null,null,null,null,null,null,null,null,null,null,null,null,null,null,null,null,"DAEWOO",5,"DAMAS",12,"SEDAN"]
[null,null,null,null,null,null,null,null,null,null,"ZARUMA",null,null,null,null,null,null,null,null,null,null,null,null,null,null,null,null,null,null,null,null,"DAEWOO",5,"KORANDO",13,"JEEP"]
[null,null,null,null,null,null,null,null,null,null,null,null,null,null,null,null,null,null,null,null,null,null,null,null,null,null,null,null,null,null,null,"DAEWOO",5,"MUSSO",14,"JEEP"]
[null,null,null,null,null,null,null,null,null,null,null,null,null,null,null,null,null,null,null,null,null,null,null,null,null,null,null,null,null,null,null,"DAEWOO",5,"LEGANZA",15,"SEDAN"]
[null,null,null,null,null,null,null,null,null,null,null,null,null,null,null,null,null,null,null,null,null,null,null,null,null,null,null,null,null,null,null,"DAIHATSU",6,"TERIOS",1,"JEEP"]
[null,null,null,null,null,null,null,null,null,null,null,null,null,null,null,null,null,null,null,null,null,null,null,null,null,null,null,null,null,null,null,"DAIHATSU",6,"APLAUSSE",2,"SEDAN"]
[null,null,null,null,null,null,null,null,null,null,null,null,null,null,null,null,null,null,null,null,null,null,null,null,null,null,null,null,null,null,null,"DAIHATSU",6,"CHARADE",3,"SEDAN"]
[null,null,null,null,null,null,null,null,null,null,null,null,null,null,null,null,null,null,null,null,null,null,null,null,null,null,null,null,null,null,null,"DAIHATSU",6,"FEROZA",5,"JEEP"]
[null,null,null,null,null,null,null,null,null,null,null,null,null,null,null,null,null,null,null,null,null,null,null,null,null,null,null,null,null,null,null,"DAIHATSU",6,"GRAND MOVE",6,"SEDAN"]
[null,null,null,null,null,null,null,null,null,null,null,null,null,null,null,null,null,null,null,null,null,null,null,null,null,null,null,null,null,null,null,"DAIHATSU",6,"ROCKY",7,"JEEP"]
[null,null,null,null,null,null,null,null,null,null,null,null,null,null,null,null,null,null,null,null,null,null,null,null,null,null,null,null,null,null,null,"DAIHATSU",6,"A45 L",8,"SEDAN"]
[null,null,"DOCUMENTOS PERSONA NATURAL",null,null,null,null,null,null,null,null,null,null,null,null,null,null,null,null,null,null,null,null,null,null,null,null,null,null,null,null,"DAIHATSU",6,"COURE",9,"SEDAN"]
[null,null,"DOCUMENTOS PERSONA JURÍDICA",null,null,null,null,null,null,null,null,null,null,null,null,null,null,null,null,null,null,null,null,null,null,null,null,null,null,null,null,"DATSUN",30,1200,1,"PICK-UP"]
[null,null,null,null,null,null,null,null,null,null,null,null,null,null,null,null,null,null,null,null,null,null,null,null,null,null,null,null,null,null,null,"DATSUN",30,1500,2,"PICK-UP"]
[null,null,null,null,null,null,null,null,null,null,null,null,null,null,null,null,null,null,null,null,null,null,null,null,null,null,null,null,null,null,null,"DATSUN",30,1800,3,"PICK-UP"]
[null,null,null,null,null,null,null,null,null,null,null,null,null,null,null,null,null,null,null,null,null,null,null,null,null,null,null,null,null,null,null,"DATSUN",30,"120Y",4,"SEDAN"]
[null,null,null,null,null,null,null,null,null,null,null,null,null,null,null,null,null,null,null,null,null,null,null,null,null,null,null,null,null,null,null,"DATSUN",30,"160J",5,"SEDAN"]
[null,null,null,null,null,null," ",null,null,null,null,null,null,null,null,null,null,null,null,null,null,null,null,null,null,null,null,null,null,null,null,"DATSUN",30,"B 210",6,"COUPE"]
[null,null,null,null,null,null,null,null,null,null,null,null,null,null,null,null,null,null,null,null,null,null,null,null,null,null,null,null,null,null,null,"DATSUN",30,1000,7,"PICK-UP"]
[null,null,null,null,null,null,null,null,null,null,null,null,null,null,null,null,null,null,null,null,null,null,null,null,null,null,null,null,null,null,null,"DEER",111,"CC 1020 D",1,"PICK-UP"]
[null,null,null,null,null,null,null,null,null,null,null,null,null,null,null,null,null,null,null,null,null,null,null,null,null,null,null,null,null,null,null,"DODGE",31,"RAM 4X4",1,"PICK-UP"]
[null,null,null,null,null,null,null,null,null,null,null,null,null,null,null,null,null,null,null,null,null,null,null,null,null,null,null,null,null,null,null,"DODGE",31,"RAM 4X2",2,"PICK-UP"]
[null,null,null,null,null,null,null,null,null,null,null,null,null,null,null,null,null,null,null,null,null,null,null,null,null,null,null,null,null,null,null,"DODGE",31,"DAKOTA",3,"PICK-UP"]
[null,null,null,null,null,null,null,null,null,null,null,null,null,null,null,null,null,null,null,null,null,null,null,null,null,null,null,null,null,null,null,"DODGE",31,"DURANGO",4,"JEEP"]
[null,null,null,null,null,null,null,null,null,null,null,null,null,null,null,null,null,null,null,null,null,null,null,null,null,null,null,null,null,null,null,"DODGE",31,"ASPEN",5,"SEDAN"]
[null,null,null,null,null,null,null,null,null,null,null,null,null,null,null,null,null,null,null,null,null,null,null,null,null,null,null,null,null,null,null,"DODGE",31,"CARAVAN",7,"MINI VAN"]
[null,null,null,null,null,null,null,null,null,null,null,null,null,null,null,null,null,null,null,null,null,null,null,null,null,null,null,null,null,null,null,"FIAT",7,"UNO MILLE",1,"SEDAN"]
[null,null,null,null,null,null,null,null,null,null,null,null,null,null,null,null,null,null,null,null,null,null,null,null,null,null,null,null,null,null,null,"FIAT",7,"UNO",2,"COUPE"]
[null,null,null,null,null,null,null,null,null,null,null,null,null,null,null,null,null,null,null,null,null,null,null,null,null,null,null,null,null,null,null,"FIAT",7,"PREMIO",3,"SEDAN"]
[null,null,null,null,null,null,null,null,null,null,null,null,null,null,null,null,null,null,null,null,null,null,null,null,null,null,null,null,null,null,null,"FIAT",7,"FIORINO",4,"PICK-UP"]
[null,null,null,null,null,null,null,null,null,null,null,null,null,null,null,null,null,null,null,null,null,null,null,null,null,null,null,null,null,null,null,"FIAT",7,"PALIO",5,"SEDAN"]
[null,null,null,null,null,null,null,null,null,null,null,null,null,null,null,null,null,null,null,null,null,null,null,null,null,null,null,null,null,null,null,"FIAT",7,"POLSKY",6,"SEDAN"]
[null,null,null,null,null,null,null,null,null,null,null,null,null,null,null,null,null,null,null,null,null,null,null,null,null,null,null,null,null,null,null,"FIAT",7,"SPAZIO",7,"SEDAN"]
[null,null,null,null,null,null,null,null,null,null,null,null,null,null,null,null,null,null,null,null,null,null,null,null,null,null,null,null,null,null,null,"FIAT",7,"WEEKWEND",8,"SEDAN"]
[null,null,null,null,null,null,null,null,null,null,null,null,null,null,null,null,null,null,null,null,null,null,null,null,null,null,null,null,null,null,null,"FIAT",7,"CROMA",9,"SEDAN"]
[null,null,null,null,null,null,null,null,null,null,null,null,null,null,null,null,null,null,null,null,null,null,null,null,null,null,null,null,null,null,null,"FIAT",7,124,10,"COUPE"]
[null,null,null,null,null,null,null,null,null,null,null,null,null,null,null,null,null,null,null,null,null,null,null,null,null,null,null,null,null,null,null,"FIAT",7,132,11,"SEDAN"]
[null,null,null,null,null,null,null,null,null,null,null,null,null,null,null,null,null,null,null,null,null,null,null,null,null,null,null,null,null,null,null,"FIAT",7,"TIPO SX",13,"SEDAN"]
[null,null,null,null,null,null,null,null,null,null,null,null,null,null,null,null,null,null,null,null,null,null,null,null,null,null,null,null,null,null,null,"FIAT",7,"FLARESIDE",14,"SEDAN"]
[null,null,null,null,null,null,null,null,null,null,null,null,null,null,null,null,null,null,null,null,null,null,null,null,null,null,null,null,null,null,null,"FIAT",7,"SIENA",15,"SEDAN"]
[null,null,null,null,null,null,null,null,null,null,null,null,null,null,null,null,null,null,null,null,null,null,null,null,null,null,null,null,null,null,null,"FIAT",7,"STRADA",16,"PICK-UP"]
[null,null,null,null,null,null,null,null,null,null,null,null,null,null,null,null,null,null,null,null,null,null,null,null,null,null,null,null,null,null,null,"FIAT",7,"STILO CONFORT",17,"SEDAN"]
[null,null,null,null,null,null,null,null,null,null,null,null,null,null,null,null,null,null,null,null,null,null,null,null,null,null,null,null,null,null,null,"FIAT",7,"STILO",18,"SEDAN"]
[null,null,null,null,null,null,null,null,null,null,null,null,null,null,null,null,null,null,null,null,null,null,null,null,null,null,null,null,null,null,null,"FORD",8,"FESTIVA",1,"SEDAN"]
[null,null,null,null,null,null,null,null,null,null,null,null,null,null,null,null,null,null,null,null,null,null,null,null,null,null,null,null,null,null,null,"FORD",8,"ESCORT",2,"SEDAN"]
[null,null,null,null,null,null,null,null,null,null,null,null,null,null,null,null,null,null,null,null,null,null,null,null,null,null,null,null,null,null,null,"FORD",8,"COURIER",3,"PICK-UP"]
[null,null,null,null,null,null,null,null,null,null,null,null,null,null,null,null,null,null,null,null,null,null,null,null,null,null,null,null,null,null,null,"FORD",8,"RANGER 4X2",4,"PICK-UP"]
[null,null,null,null,null,null,null,null,null,null,null,null,null,null,null,null,null,null,null,null,null,null,null,null,null,null,null,null,null,null,null,"FORD",8,"RANGER 4X4",5,"PICK-UP"]
[null,null,null,null,null,null,null,null,null,null,null,null,null,null,null,null,null,null,null,null,null,null,null,null,null,null,null,null,null,null,null,"FORD",8,"RANGER CREW CAB 4X4",6,"PICK-UP"]
[null,null,null,null,null,null,null,null,null,null,null,null,null,null,null,null,null,null,null,null,null,null,null,null,null,null,null,null,null,null,null,"FORD",8,"F-150 XL 4X2",7,"PICK-UP"]
[null,null,null,null,null,null,null,null,null,null,null,null,null,null,null,null,null,null,null,null,null,null,null,null,null,null,null,null,null,null,null,"FORD",8,"F-150 XL 4X4",8,"PICK-UP"]
[null,null,null,null,null,null,null,null,null,null,null,null,null,null,null,null,null,null,null,null,null,null,null,null,null,null,null,null,null,null,null,"FORD",8,"F-150 LARIAT",9,"PICK-UP"]
[null,null,null,null,null,null,null,null,null,null,null,null,null,null,null,null,null,null,null,null,null,null,null,null,null,null,null,null,null,null,null,"FORD",8,"BRONCO",10,"JEEP"]
[null,null,null,null,null,null,null,null,null,null,null,null,null,null,null,null,null,null,null,null,null,null,null,null,null,null,null,null,null,null,null,"FORD",8,"EXPLORER 4X2 XL 3P",11,"JEEP"]
[null,null,null,null,null,null,null,null,null,null,null,null,null,null,null,null,null,null,null,null,null,null,null,null,null,null,null,null,null,null,null,"FORD",8,"EXPLORER 4X4 3P",12,"JEEP"]
[null,null,null,null,null,null,null,null,null,null,null,null,null,null,null,null,null,null,null,null,null,null,null,null,null,null,null,null,null,null,null,"FORD",8,"EXPLORER 4X4 5P",13,"JEEP"]
[null,null,null,null,null,null,null,null,null,null,null,null,null,null,null,null,null,null,null,null,null,null,null,null,null,null,null,null,null,null,null,"FORD",8,"EXPLORER 4X2 5P",14,"JEEP"]
[null,null,null,null,null,null,null,null,null,null,null,null,null,null,null,null,null,null,null,null,null,null,null,null,null,null,null,null,null,null,null,"FORD",8,"EXPEDITION EDDIE BAUER",15,"JEEP"]
[null,null,null,null,null,null,null,null,null,null,null,null,null,null,null,null,null,null,null,null,null,null,null,null,null,null,null,null,null,null,null,"FORD",8,"ESCAPE",16,"JEEP"]
[null,null,null,null,null,null,null,null,null,null,null,null,null,null,null,null,null,null,null,null,null,null,null,null,null,null,null,null,null,null,null,"FORD",8,"AEROSTAR",17,"MINI VAN"]
[null,null,null,null,null,null,null,null,null,null,null,null,null,null,null,null,null,null,null,null,null,null,null,null,null,null,null,null,null,null,null,"FORD",8,"CLUB WAGON",18,"MINI VAN"]
[null,null,null,null,null,null,null,null,null,null,null,null,null,null,null,null,null,null,null,null,null,null,null,null,null,null,null,null,null,null,null,"FORD",8,"CONTOUR",19,"SEDAN"]
[null,null,null,null,null,null,null,null,null,null,null,null,null,null,null,null,null,null,null,null,null,null,null,null,null,null,null,null,null,null,null,"FORD",8,"ECONOLINE",20,"MINI VAN"]
[null,null,null,null,null,null,null,null,null,null,null,null,null,null,null,null,null,null,null,null,null,null,null,null,null,null,null,null,null,null,null,"FORD",8,"F-250",21,"PICK-UP"]
[null,null,null,null,null,null,null,null,null,null,null,null,null,null,null,null,null,null,null,null,null,null,null,null,null,null,null,null,null,null,null,"FORD",8,"F-350",22,"PICK-UP"]
[null,null,null,null,null,null,null,null,null,null,null,null,null,null,null,null,null,null,null,null,null,null,null,null,null,null,null,null,null,null,null,"FORD",8,"F-470",23,"PICK-UP"]
[null,null,null,null,null,null,null,null,null,null,null,null,null,null,null,null,null,null,null,null,null,null,null,null,null,null,null,null,null,null,null,"FORD",8,"F-600",24,"PICK-UP"]
[null,null,null,null,null,null,null,null,null,null,null,null,null,null,null,null,null,null,null,null,null,null,null,null,null,null,null,null,null,null,null,"FORD",8,"F-700",25,"PICK-UP"]
[null,null,null,null,null,null,null,null,null,null,null,null,null,null,null,null,null,null,null,null,null,null,null,null,null,null,null,null,null,null,null,"FORD",8,"FIESTA",26,"COUPE"]
[null,null,null,null,null,null,null,null,null,null,null,null,null,null,null,null,null,null,null,null,null,null,null,null,null,null,null,null,null,null,null,"FORD",8,"MAVERICK",27,"SEDAN"]
[null,null,null,null,null,null,null,null,null,null,null,null,null,null,null,null,null,null,null,null,null,null,null,null,null,null,null,null,null,null,null,"FORD",8,"MONDEO",28,"SEDAN"]
[null,null,null,null,null,null,null,null,null,null,null,null,null,null,null,null,null,null,null,null,null,null,null,null,null,null,null,null,null,null,null,"FORD",8,"TAURUS",29,"SEDAN"]
[null,null,null,null,null,null,null,null,null,null,null,null,null,null,null,null,null,null,null,null,null,null,null,null,null,null,null,null,null,null,null,"FORD",8,"SIERRA",30,"PICK-UP"]
[null,null,null,null,null,null,null,null,null,null,null,null,null,null,null,null,null,null,null,null,null,null,null,null,null,null,null,null,null,null,null,"FORD",8,"SUPER DUTY",31,"MINI VAN"]
[null,null,null,null,null,null,null,null,null,null,null,null,null,null,null,null,null,null,null,null,null,null,null,null,null,null,null,null,null,null,null,"FORD",8,"TEMPO",32,"SEDAN"]
[null,null,null,null,null,null,null,null,null,null,null,null,null,null,null,null,null,null,null,null,null,null,null,null,null,null,null,null,null,null,null,"FORD",8,"WINDSTAR",33,"MINI VAN"]
[null,null,null,null,null,null,null,null,null,null,null,null,null,null,null,null,null,null,null,null,null,null,null,null,null,null,null,null,null,null,null,"FORD",8,"FUERTE",34,"JEEP"]
[null,null,null,null,null,null,null,null,null,null,null,null,null,null,null,null,null,null,null,null,null,null,null,null,null,null,null,null,null,null,null,"FORD",8,"F-100",35,"PICK-UP"]
[null,null,null,null,null,null,null,null,null,null,null,null,null,null,null,null,null,null,null,null,null,null,null,null,null,null,null,null,null,null,null,"FORD",8,"LASER",36,"SEDAN"]
[null,null,null,null,null,null,null,null,null,null,null,null,null,null,null,null,null,null,null,null,null,null,null,null,null,null,null,null,null,null,null,"FORD",8,"MUSTANG",38,"COUPE"]
[null,null,null,null,null,null,null,null,null,null,null,null,null,null,null,null,null,null,null,null,null,null,null,null,null,null,null,null,null,null,null,"FORD",8,"RANGER 4X2 D/C",40,"PICK-UP"]
[null,null,null,null,null,null,null,null,null,null,null,null,null,null,null,null,null,null,null,null,null,null,null,null,null,null,null,null,null,null,null,"FORD",8,"RANGER 4X4 D/C",41,"PICK-UP"]
[null,null,null,null,null,null,null,null,null,null,null,null,null,null,null,null,null,null,null,null,null,null,null,null,null,null,null,null,null,null,null,"FORD",8,"CUSTOM",42,"PICK-UP"]
[null,null,null,null,null,null,null,null,null,null,null,null,null,null,null,null,null,null,null,null,null,null,null,null,null,null,null,null,null,null,null,"FORD",8,"F-500",45,"PICK-UP"]
[null,null,null,null,null,null,null,null,null,null,null,null,null,null,null,null,null,null,null,null,null,null,null,null,null,null,null,null,null,null,null,"FORD",8,"F-650",46,"PICK-UP"]
[null,null,null,null,null,null,null,null,null,null,null,null,null,null,null,null,null,null,null,null,null,null,null,null,null,null,null,null,null,null,null,"FORD",8,"F-750",47,"PICK-UP"]
[null,null,null,null,null,null,null,null,null,null,null,null,null,null,null,null,null,null,null,null,null,null,null,null,null,null,null,null,null,null,null,"FORD",8,"FIESTA 4P",48,"SEDAN"]
[null,null,null,null,null,null,null,null,null,null,null,null,null,null,null,null,null,null,null,null,null,null,null,null,null,null,null,null,null,null,null,"FORD",8,"LTD",49,"SEDAN"]
[null,null,null,null,null,null,null,null,null,null,null,null,null,null,null,null,null,null,null,null,null,null,null,null,null,null,null,null,null,null,null,"FORD",8,"EXCURSION 4X4",50,"JEEP"]
[null,null,null,null,null,null,null,null,null,null,null,null,null,null,null,null,null,null,null,null,null,null,null,null,null,null,null,null,null,null,null,"FORD",8,"ECOSPORT 4X2",51,"JEEP"]
[null,null,null,null,null,null,null,null,null,null,null,null,null,null,null,null,null,null,null,null,null,null,null,null,null,null,null,null,null,null,null,"FORD",8,"ECOSPORT 4X4",52,"JEEP"]
[null,null,null,null,null,null,null,null,null,null,null,null,null,null,null,null,null,null,null,null,null,null,null,null,null,null,null,null,null,null,null,"FORD",8,"FOCUS",53,"SEDAN"]
[null,null,null,null,null,null,null,null,null,null,null,null,null,null,null,null,null,null,null,null,null,null,null,null,null,null,null,null,null,null,null,"FORD",8,"EXPLORER SPORT TRACK",54,"JEEP"]
[null,null,null,null,null,null,null,null,null,null,null,null,null,null,null,null,null,null,null,null,null,null,null,null,null,null,null,null,null,null,null,"FORD",8,"GRANADA",55,"SEDAN"]
[null,null,null,null,null,null,null,null,null,null,null,null,null,null,null,null,null,null,null,null,null,null,null,null,null,null,null,null,null,null,null,"FORD",8,"EXPLORER SPORT TRACK 4X2",56,"JEEP"]
[null,null,null,null,null,null,null,null,null,null,null,null,null,null,null,null,null,null,null,null,null,null,null,null,null,null,null,null,null,null,null,"FSO",77,"GLE 1600CC",1,"SEDAN"]
[null,null,null,null,null,null,null,null,null,null,null,null,null,null,null,null,null,null,null,null,null,null,null,null,null,null,null,null,null,null,null,"GMC",70,"SIERRA",1,"JEEP"]
[null,null,null,null,null,null,null,null,null,null,null,null,null,null,null,null,null,null,null,null,null,null,null,null,null,null,null,null,null,null,null,"GMC",70,"BLAZER",2,"JEEP"]
[null,null,null,null,null,null,null,null,null,null,null,null,null,null,null,null,null,null,null,null,null,null,null,null,null,null,null,null,null,null,null,"GMC",70,"SAFARY",3,"PICK-UP"]
[null,null,null,null,null,null,null,null,null,null,null,null,null,null,null,null,null,null,null,null,null,null,null,null,null,null,null,null,null,null,null,"GREAT WALL",108,"CC1020C C/S",1,"PICK-UP"]
[null,null,null,null,null,null,null,null,null,null,null,null,null,null,null,null,null,null,null,null,null,null,null,null,null,null,null,null,null,null,null,"GREAT WALL",108,"CC1020D",2,"PICK-UP"]
[null,null,null,null,null,null,null,null,null,null,null,null,null,null,null,null,null,null,null,null,null,null,null,null,null,null,null,null,null,null,null,"HONDA",9,"CRV 4X4",1,"JEEP"]
[null,null,null,null,null,null,null,null,null,null,null,null,null,null,null,null,null,null,null,null,null,null,null,null,null,null,null,null,null,null,null,"HONDA",9,"CIVIC",2,"SEDAN"]
[null,null,null,null,null,null,null,null,null,null,null,null,null,null,null,null,null,null,null,null,null,null,null,null,null,null,null,null,null,null,null,"HONDA",9,"ACCORD",3,"SEDAN"]
[null,null,null,null,null,null,null,null,null,null,null,null,null,null,null,null,null,null,null,null,null,null,null,null,null,null,null,null,null,null,null,"HONDA",9,"INTEGRA",6,"SEDAN"]
[null,null,null,null,null,null,null,null,null,null,null,null,null,null,null,null,null,null,null,null,null,null,null,null,null,null,null,null,null,null,null,"HONDA",9,"PRELUDE",7,"COUPE"]
[null,null,null,null,null,null,null,null,null,null,null,null,null,null,null,null,null,null,null,null,null,null,null,null,null,null,null,null,null,null,null,"HONDA",9,"ACURA",9,"SEDAN"]
[null,null,null,null,null,null,null,null,null,null,null,null,null,null,null,null,null,null,null,null,null,null,null,null,null,null,null,null,null,null,null,"HONDA",9,"ODYSSEY",11,"MINI VAN"]
[null,null,null,null,null,null,null,null,null,null,null,null,null,null,null,null,null,null,null,null,null,null,null,null,null,null,null,null,null,null,null,"HONDA",9,"CIVIC DEL SOL",14,"COUPE"]
[null,null,null,null,null,null,null,null,null,null,null,null,null,null,null,null,null,null,null,null,null,null,null,null,null,null,null,null,null,null,null,"HONDA",9,"FIT",17,"SEDAN"]
[null,null,null,null,null,null,null,null,null,null,null,null,null,null,null,null,null,null,null,null,null,null,null,null,null,null,null,null,null,null,null,"HONDA",9,"PILOT",20,"SEDAN"]
[null,null,null,null,null,null,null,null,null,null,null,null,null,null,null,null,null,null,null,null,null,null,null,null,null,null,null,null,null,null,null,"HONDA",9,"LEGEND",21,"SEDAN"]
[null,null,null,null,null,null,null,null,null,null,null,null,null,null,null,null,null,null,null,null,null,null,null,null,null,null,null,null,null,null,null,"HONDA",9,"CRV 4X2",28,"JEEP"]
[null,null,null,null,null,null,null,null,null,null,null,null,null,null,null,null,null,null,null,null,null,null,null,null,null,null,null,null,null,null,null,"HUMMER",115,"H2 UTILITY WAGON 4WD",1,"JEEP"]
[null,null,null,null,null,null,null,null,null,null,null,null,null,null,null,null,null,null,null,null,null,null,null,null,null,null,null,null,null,null,null,"HYUNDAI",10,"ACCENT",1,"SEDAN"]
[null,null,null,null,null,null,null,null,null,null,null,null,null,null,null,null,null,null,null,null,null,null,null,null,null,null,null,null,null,null,null,"HYUNDAI",10,"ACCENT VERNA",2,"SEDAN"]
[null,null,null,null,null,null,null,null,null,null,null,null,null,null,null,null,null,null,null,null,null,null,null,null,null,null,null,null,null,null,null,"HYUNDAI",10,"SANTA FE 4X4",3,"JEEP"]
[null,null,null,null,null,null,null,null,null,null,null,null,null,null,null,null,null,null,null,null,null,null,null,null,null,null,null,null,null,null,null,"HYUNDAI",10,"EXCEL 4P",4,"SEDAN"]
[null,null,null,null,null,null,null,null,null,null,null,null,null,null,null,null,null,null,null,null,null,null,null,null,null,null,null,null,null,null,null,"HYUNDAI",10,"EXCEL 5P",5,"SEDAN"]
[null,null,null,null,null,null,null,null,null,null,null,null,null,null,null,null,null,null,null,null,null,null,null,null,null,null,null,null,null,null,null,"HYUNDAI",10,"ELANTRA",6,"SEDAN"]
[null,null,null,null,null,null,null,null,null,null,null,null,null,null,null,null,null,null,null,null,null,null,null,null,null,null,null,null,null,null,null,"HYUNDAI",10,"ATOS",7,"SEDAN"]
[null,null,null,null,null,null,null,null,null,null,null,null,null,null,null,null,null,null,null,null,null,null,null,null,null,null,null,null,null,null,null,"HYUNDAI",10,"ATOS SEMIFULL",8,"SEDAN"]
[null,null,null,null,null,null,null,null,null,null,null,null,null,null,null,null,null,null,null,null,null,null,null,null,null,null,null,null,null,null,null,"HYUNDAI",10,"ELANTRA AVANTE",9,"SEDAN"]
[null,null,null,null,null,null,null,null,null,null,null,null,null,null,null,null,null,null,null,null,null,null,null,null,null,null,null,null,null,null,null,"HYUNDAI",10,"GALLOPER",10,"JEEP"]
[null,null,null,null,null,null,null,null,null,null,null,null,null,null,null,null,null,null,null,null,null,null,null,null,null,null,null,null,null,null,null,"HYUNDAI",10,"PONNY",14,"COUPE"]
[null,null,null,null,null,null,null,null,null,null,null,null,null,null,null,null,null,null,null,null,null,null,null,null,null,null,null,null,null,null,null,"HYUNDAI",10,"SCOUPE",15,"COUPE"]
[null,null,null,null,null,null,null,null,null,null,null,null,null,null,null,null,null,null,null,null,null,null,null,null,null,null,null,null,null,null,null,"HYUNDAI",10,"SONATA",16,"SEDAN"]
[null,null,null,null,null,null,null,null,null,null,null,null,null,null,null,null,null,null,null,null,null,null,null,null,null,null,null,null,null,null,null,"HYUNDAI",10,"GRAND SALOON",19,"SEDAN"]
[null,null,null,null,null,null,null,null,null,null,null,null,null,null,null,null,null,null,null,null,null,null,null,null,null,null,null,null,null,null,null,"HYUNDAI",10,"TERRACAN",20,"JEEP"]
[null,null,null,null,null,null,null,null,null,null,null,null,null,null,null,null,null,null,null,null,null,null,null,null,null,null,null,null,null,null,null,"HYUNDAI",10,"MATRIX",21,"MINI VAN"]
[null,null,null,null,null,null,null,null,null,null,null,null,null,null,null,null,null,null,null,null,null,null,null,null,null,null,null,null,null,null,null,"HYUNDAI",10,"SANTAMO",24,"SEDAN"]
[null,null,null,null,null,null,null,null,null,null,null,null,null,null,null,null,null,null,null,null,null,null,null,null,null,null,null,null,null,null,null,"HYUNDAI",10,"GETZ",25,"SEDAN"]
[null,null,null,null,null,null,null,null,null,null,null,null,null,null,null,null,null,null,null,null,null,null,null,null,null,null,null,null,null,null,null,"HYUNDAI",10,"TRAJET",26,"SEDAN"]
[null,null,null,null,null,null,null,null,null,null,null,null,null,null,null,null,null,null,null,null,null,null,null,null,null,null,null,null,null,null,null,"HYUNDAI",10,"HI",27,"SEDAN"]
[null,null,null,null,null,null,null,null,null,null,null,null,null,null,null,null,null,null,null,null,null,null,null,null,null,null,null,null,null,null,null,"HYUNDAI",10,"WINDOW VAN",28,"MINI VAN"]
[null,null,null,null,null,null,null,null,null,null,null,null,null,null,null,null,null,null,null,null,null,null,null,null,null,null,null,null,null,null,null,"HYUNDAI",10,"SANTA FE 4X2",29,"JEEP"]
[null,null,null,null,null,null,null,null,null,null,null,null,null,null,null,null,null,null,null,null,null,null,null,null,null,null,null,null,null,null,null,"HYUNDAI",10,"TUCSON",30,"JEEP"]
[null,null,null,null,null,null,null,null,null,null,null,null,null,null,null,null,null,null,null,null,null,null,null,null,null,null,null,null,null,null,null,"INTERNATIONAL",44,"SCOUT II",3,"JEEP"]
[null,null,null,null,null,null,null,null,null,null,null,null,null,null,null,null,null,null,null,null,null,null,null,null,null,null,null,null,null,null,null,"ISUZU",34,"NPR NLD",1,"PICK-UP"]
[null,null,null,null,null,null,null,null,null,null,null,null,null,null,null,null,null,null,null,null,null,null,null,null,null,null,null,null,null,null,null,"ISUZU",34,"RODEO",2,"JEEP"]
[null,null,null,null,null,null,null,null,null,null,null,null,null,null,null,null,null,null,null,null,null,null,null,null,null,null,null,null,null,null,null,"ISUZU",34,"TROOPER",3,"JEEP"]
[null,null,null,null,null,null,null,null,null,null,null,null,null,null,null,null,null,null,null,null,null,null,null,null,null,null,null,null,null,null,null,"JAGUAR",35,"J6",1,"SEDAN"]
[null,null,null,null,null,null,null,null,null,null,null,null,null,null,null,null,null,null,null,null,null,null,null,null,null,null,null,null,null,null,null,"JEEP",71,"WILLYS",1,"JEEP"]
[null,null,null,null,null,null,null,null,null,null,null,null,null,null,null,null,null,null,null,null,null,null,null,null,null,null,null,null,null,null,null,"JEEP",71,"WRANGLER",2,"JEEP"]
[null,null,null,null,null,null,null,null,null,null,null,null,null,null,null,null,null,null,null,null,null,null,null,null,null,null,null,null,null,null,null,"JEEP",71,"WRANGLER SAHARA",3,"JEEP"]
[null,null,null,null,null,null,null,null,null,null,null,null,null,null,null,null,null,null,null,null,null,null,null,null,null,null,null,null,null,null,null,"JEEP",71,"CHEROKEE RENEGADE",4,"JEEP"]
[null,null,null,null,null,null,null,null,null,null,null,null,null,null,null,null,null,null,null,null,null,null,null,null,null,null,null,null,null,null,null,"JEEP",71,"CHEROKEE",5,"JEEP"]
[null,null,null,null,null,null,null,null,null,null,null,null,null,null,null,null,null,null,null,null,null,null,null,null,null,null,null,null,null,null,null,"JEEP",71,"GRAND CHEROKEE",6,"JEEP"]
[null,null,null,null,null,null,null,null,null,null,null,null,null,null,null,null,null,null,null,null,null,null,null,null,null,null,null,null,null,null,null,"JEEP",71,"LIBERTY LIMITED",7,"JEEP"]
[null,null,null,null,null,null,null,null,null,null,null,null,null,null,null,null,null,null,null,null,null,null,null,null,null,null,null,null,null,null,null,"JEEP",71,"GRAND WAGONER",8,"JEEP"]
[null,null,null,null,null,null,null,null,null,null,null,null,null,null,null,null,null,null,null,null,null,null,null,null,null,null,null,null,null,null,null,"KIA",11,"SPORTAGE 4X4",1,"JEEP"]
[null,null,null,null,null,null,null,null,null,null,null,null,null,null,null,null,null,null,null,null,null,null,null,null,null,null,null,null,null,null,null,"KIA",11,"CARENS",2,"MINI VAN"]
[null,null,null,null,null,null,null,null,null,null,null,null,null,null,null,null,null,null,null,null,null,null,null,null,null,null,null,null,null,null,null,"KIA",11,"RIO 4P",3,"SEDAN"]
[null,null,null,null,null,null,null,null,null,null,null,null,null,null,null,null,null,null,null,null,null,null,null,null,null,null,null,null,null,null,null,"KIA",11,"CARNIVAL",4,"MINI VAN"]
[null,null,null,null,null,null,null,null,null,null,null,null,null,null,null,null,null,null,null,null,null,null,null,null,null,null,null,null,null,null,null,"KIA",11,"PRIDE POP",8,"COUPE"]
[null,null,null,null,null,null,null,null,null,null,null,null,null,null,null,null,null,null,null,null,null,null,null,null,null,null,null,null,null,null,null,"KIA",11,"SHEPIA",9,"SEDAN"]
[null,null,null,null,null,null,null,null,null,null,null,null,null,null,null,null,null,null,null,null,null,null,null,null,null,null,null,null,null,null,null,"KIA",11,"CERES 4X2",10,"PICK-UP"]
[null,null,null,null,null,null,null,null,null,null,null,null,null,null,null,null,null,null,null,null,null,null,null,null,null,null,null,null,null,null,null,"KIA",11,"K2700 C/S",11,"PICK-UP"]
[null,null,null,null,null,null,null,null,null,null,null,null,null,null,null,null,null,null,null,null,null,null,null,null,null,null,null,null,null,null,null,"KIA",11,"K2400 C/S",12,"PICK-UP"]
[null,null,null,null,null,null,null,null,null,null,null,null,null,null,null,null,null,null,null,null,null,null,null,null,null,null,null,null,null,null,null,"KIA",11,"K3600",13,"PICK-UP"]
[null,null,null,null,null,null,null,null,null,null,null,null,null,null,null,null,null,null,null,null,null,null,null,null,null,null,null,null,null,null,null,"KIA",11,"SPECTRA",14,"SEDAN"]
[null,null,null,null,null,null,null,null,null,null,null,null,null,null,null,null,null,null,null,null,null,null,null,null,null,null,null,null,null,null,null,"KIA",11,"SORENTO",17,"JEEP"]
[null,null,null,null,null,null,null,null,null,null,null,null,null,null,null,null,null,null,null,null,null,null,null,null,null,null,null,null,null,null,null,"KIA",11,"RIO STYLUS",18,"SEDAN"]
[null,null,null,null,null,null,null,null,null,null,null,null,null,null,null,null,null,null,null,null,null,null,null,null,null,null,null,null,null,null,null,"KIA",11,"PICANTO",19,"SEDAN"]
[null,null,null,null,null,null,null,null,null,null,null,null,null,null,null,null,null,null,null,null,null,null,null,null,null,null,null,null,null,null,null,"KIA",11,"CERATO",20,"SEDAN"]
[null,null,null,null,null,null,null,null,null,null,null,null,null,null,null,null,null,null,null,null,null,null,null,null,null,null,null,null,null,null,null,"LADA",13,2107,1,"SEDAN"]
[null,null,null,null,null,null,null,null,null,null,null,null,null,null,null,null,null,null,null,null,null,null,null,null,null,null,null,null,null,null,null,"LADA",13,"NIVA",2,"JEEP"]
[null,null,null,null,null,null,null,null,null,null,null,null,null,null,null,null,null,null,null,null,null,null,null,null,null,null,null,null,null,null,null,"LADA",13,2104,3,"SEDAN"]
[null,null,null,null,null,null,null,null,null,null,null,null,null,null,null,null,null,null,null,null,null,null,null,null,null,null,null,null,null,null,null,"LADA",13,2106,4,"SEDAN"]
[null,null,null,null,null,null,null,null,null,null,null,null,null,null,null,null,null,null,null,null,null,null,null,null,null,null,null,null,null,null,null,"LADA",13,2109,5,"SEDAN"]
[null,null,null,null,null,null,null,null,null,null,null,null,null,null,null,null,null,null,null,null,null,null,null,null,null,null,null,null,null,null,null,"LADA",13,1600,6,"SEDAN"]
[null,null,null,null,null,null,null,null,null,null,null,null,null,null,null,null,null,null,null,null,null,null,null,null,null,null,null,null,null,null,null,"LADA",13,2105,7,"SEDAN"]
[null,null,null,null,null,null,null,null,null,null,null,null,null,null,null,null,null,null,null,null,null,null,null,null,null,null,null,null,null,null,null,"LADA",13,2101,8,"SEDAN"]
[null,null,null,null,null,null,null,null,null,null,null,null,null,null,null,null,null,null,null,null,null,null,null,null,null,null,null,null,null,null,null,"LADA",13,"100 SEDAN",9,"SEDAN"]
[null,null,null,null,null,null,null,null,null,null,null,null,null,null,null,null,null,null,null,null,null,null,null,null,null,null,null,null,null,null,null,"LADA",13,2110,10,"SEDAN"]
[null,null,null,null,null,null,null,null,null,null,null,null,null,null,null,null,null,null,null,null,null,null,null,null,null,null,null,null,null,null,null,"LADA",13,110,11,"SEDAN"]
[null,null,null,null,null,null,null,null,null,null,null,null,null,null,null,null,null,null,null,null,null,null,null,null,null,null,null,null,null,null,null,"LADA",13,2112,12,"STATION WAGON"]
[null,null,null,null,null,null,null,null,null,null,null,null,null,null,null,null,null,null,null,null,null,null,null,null,null,null,null,null,null,null,null,"LADA",13,"100 STATION WAGON",13,"STATION WAGON"]
[null,null,null,null,null,null,null,null,null,null,null,null,null,null,null,null,null,null,null,null,null,null,null,null,null,null,null,null,null,null,null,"LADA",13,21102,14,"SEDAN"]
[null,null,null,null,null,null,null,null,null,null,null,null,null,null,null,null,null,null,null,null,null,null,null,null,null,null,null,null,null,null,null,"LADA",13,115,15,"SEDAN"]
[null,null,null,null,null,null,null,null,null,null,null,null,null,null,null,null,null,null,null,null,null,null,null,null,null,null,null,null,null,null,null,"LADA",13,21122,16,"SEDAN"]
[null,null,null,null,null,null,null,null,null,null,null,null,null,null,null,null,null,null,null,null,null,null,null,null,null,null,null,null,null,null,null,"LANCIA",36,"AUTOBIANCHI",1,"COUPE"]
[null,null,null,null,null,null,null,null,null,null,null,null,null,null,null,null,null,null,null,null,null,null,null,null,null,null,null,null,null,null,null,"LAND ROVER",12,"FREELANDER",1,"JEEP"]
[null,null,null,null,null,null,null,null,null,null,null,null,null,null,null,null,null,null,null,null,null,null,null,null,null,null,null,null,null,null,null,"LAND ROVER",12,"DISCOVERY",2,"JEEP"]
[null,null,null,null,null,null,null,null,null,null,null,null,null,null,null,null,null,null,null,null,null,null,null,null,null,null,null,null,null,null,null,"LAND ROVER",12,"RANGE ROVER",3,"JEEP"]
[null,null,null,null,null,null,null,null,null,null,null,null,null,null,null,null,null,null,null,null,null,null,null,null,null,null,null,null,null,null,null,"LAND ROVER",12,"ROVER 400",4,"JEEP"]
[null,null,null,null,null,null,null,null,null,null,null,null,null,null,null,null,null,null,null,null,null,null,null,null,null,null,null,null,null,null,null,"LAND ROVER",12,"DEFENDER",5,"JEEP"]
[null,null,null,null,null,null,null,null,null,null,null,null,null,null,null,null,null,null,null,null,null,null,null,null,null,null,null,null,null,null,null,"LAND ROVER",12,"VOGUE",6,"JEEP"]
[null,null,null,null,null,null,null,null,null,null,null,null,null,null,null,null,null,null,null,null,null,null,null,null,null,null,null,null,null,null,null,"LEXUS",37,"LX 470",1,"JEEP"]
[null,null,null,null,null,null,null,null,null,null,null,null,null,null,null,null,null,null,null,null,null,null,null,null,null,null,null,null,null,null,null,"LINCOLN",38,"NAVIGATOR",1,"JEEP"]
[null,null,null,null,null,null,null,null,null,null,null,null,null,null,null,null,null,null,null,null,null,null,null,null,null,null,null,null,null,null,null,"MAHINDRA",101,"SCORPIO LHD",1,"JEEP"]
[null,null,null,null,null,null,null,null,null,null,null,null,null,null,null,null,null,null,null,null,null,null,null,null,null,null,null,null,null,null,null,"MAZDA",14,"323 3P",1,"COUPE"]
[null,null,null,null,null,null,null,null,null,null,null,null,null,null,null,null,null,null,null,null,null,null,null,null,null,null,null,null,null,null,null,"MAZDA",14,"323 4P",2,"SEDAN"]
[null,null,null,null,null,null,null,null,null,null,null,null,null,null,null,null,null,null,null,null,null,null,null,null,null,null,null,null,null,null,null,"MAZDA",14,"323 5P",3,"STATION WAGON"]
[null,null,null,null,null,null,null,null,null,null,null,null,null,null,null,null,null,null,null,null,null,null,null,null,null,null,null,null,null,null,null,"MAZDA",14,"323 ALLEGRO 4P",4,"SEDAN"]
[null,null,null,null,null,null,null,null,null,null,null,null,null,null,null,null,null,null,null,null,null,null,null,null,null,null,null,null,null,null,null,"MAZDA",14,"323 ALLEGRO 5P",5,"STATION WAGON"]
[null,null,null,null,null,null,null,null,null,null,null,null,null,null,null,null,null,null,null,null,null,null,null,null,null,null,null,null,null,null,null,"MAZDA",14,626,6,"SEDAN"]
[null,null,null,null,null,null,null,null,null,null,null,null,null,null,null,null,null,null,null,null,null,null,null,null,null,null,null,null,null,null,null,"MAZDA",14,"B2200I C/S 4X2",7,"PICK-UP"]
[null,null,null,null,null,null,null,null,null,null,null,null,null,null,null,null,null,null,null,null,null,null,null,null,null,null,null,null,null,null,null,"MAZDA",14,"B2200I D/C 4X2",8,"PICK-UP"]
[null,null,null,null,null,null,null,null,null,null,null,null,null,null,null,null,null,null,null,null,null,null,null,null,null,null,null,null,null,null,null,"MAZDA",14,"B2600I C/S 4X4",9,"PICK-UP"]
[null,null,null,null,null,null,null,null,null,null,null,null,null,null,null,null,null,null,null,null,null,null,null,null,null,null,null,null,null,null,null,"MAZDA",14,"B2600I D/C 4X4",10,"PICK-UP"]
[null,null,null,null,null,null,null,null,null,null,null,null,null,null,null,null,null,null,null,null,null,null,null,null,null,null,null,null,null,null,null,"MAZDA",14,"B2000 C/S 4X2",11,"PICK-UP"]
[null,null,null,null,null,null,null,null,null,null,null,null,null,null,null,null,null,null,null,null,null,null,null,null,null,null,null,null,null,null,null,"MAZDA",14,"B2000 D/C 4X2",12,"PICK-UP"]
[null,null,null,null,null,null,null,null,null,null,null,null,null,null,null,null,null,null,null,null,null,null,null,null,null,null,null,null,null,null,null,"MAZDA",14,"PROTEGE",13,"COUPE"]
[null,null,null,null,null,null,null,null,null,null,null,null,null,null,null,null,null,null,null,null,null,null,null,null,null,null,null,null,null,null,null,"MAZDA",14,"MATSURI",14,"SEDAN"]
[null,null,null,null,null,null,null,null,null,null,null,null,null,null,null,null,null,null,null,null,null,null,null,null,null,null,null,null,null,null,null,"MAZDA",14,"MX3",15,"COUPE"]
[null,null,null,null,null,null,null,null,null,null,null,null,null,null,null,null,null,null,null,null,null,null,null,null,null,null,null,null,null,null,null,"MAZDA",14,"MPV VAN",16,"MINI VAN"]
[null,null,null,null,null,null,null,null,null,null,null,null,null,null,null,null,null,null,null,null,null,null,null,null,null,null,null,null,null,null,null,"MAZDA",14,"B2500 C/S",17,"PICK-UP"]
[null,null,null,null,null,null,null,null,null,null,null,null,null,null,null,null,null,null,null,null,null,null,null,null,null,null,null,null,null,null,null,"MAZDA",14,"B2500 C/D",18,"PICK-UP"]
[null,null,null,null,null,null,null,null,null,null,null,null,null,null,null,null,null,null,null,null,null,null,null,null,null,null,null,null,null,null,null,"MAZDA",14,"TRIBUTE AT SDX",20,"JEEP"]
[null,null,null,null,null,null,null,null,null,null,null,null,null,null,null,null,null,null,null,null,null,null,null,null,null,null,null,null,null,null,null,"MAZDA",14,"CIAO TEMPO 1.3 CC",21,"SEDAN"]
[null,null,null,null,null,null,null,null,null,null,null,null,null,null,null,null,null,null,null,null,null,null,null,null,null,null,null,null,null,null,null,"MAZDA",14,929,22,"SEDAN"]
[null,null,null,null,null,null,null,null,null,null,null,null,null,null,null,null,null,null,null,null,null,null,null,null,null,null,null,null,null,null,null,"MAZDA",14,"B29DCP",23,"PICK-UP"]
[null,null,null,null,null,null,null,null,null,null,null,null,null,null,null,null,null,null,null,null,null,null,null,null,null,null,null,null,null,null,null,"MAZDA",14,"MIATA MX5",24,"COUPE"]
[null,null,null,null,null,null,null,null,null,null,null,null,null,null,null,null,null,null,null,null,null,null,null,null,null,null,null,null,null,null,null,"MAZDA",14,"6 2.0",25,"SEDAN"]
[null,null,null,null,null,null,null,null,null,null,null,null,null,null,null,null,null,null,null,null,null,null,null,null,null,null,null,null,null,null,null,"MAZDA",14,"RX8",26,"COUPE"]
[null,null,null,null,null,null,null,null,null,null,null,null,null,null,null,null,null,null,null,null,null,null,null,null,null,null,null,null,null,null,null,"MERCEDES BENZ",15,"190E",1,"SEDAN"]
[null,null,null,null,null,null,null,null,null,null,null,null,null,null,null,null,null,null,null,null,null,null,null,null,null,null,null,null,null,null,null,"MERCEDES BENZ",15,"A160 CLASSIC",2,"SEDAN"]
[null,null,null,null,null,null,null,null,null,null,null,null,null,null,null,null,null,null,null,null,null,null,null,null,null,null,null,null,null,null,null,"MERCEDES BENZ",15,"C200 KOMPRESOR",3,"SEDAN"]
[null,null,null,null,null,null,null,null,null,null,null,null,null,null,null,null,null,null,null,null,null,null,null,null,null,null,null,null,null,null,null,"MERCEDES BENZ",15,"C240",4,"SEDAN"]
[null,null,null,null,null,null,null,null,null,null,null,null,null,null,null,null,null,null,null,null,null,null,null,null,null,null,null,null,null,null,null,"MERCEDES BENZ",15,"C320",5,"SEDAN"]
[null,null,null,null,null,null,null,null,null,null,null,null,null,null,null,null,null,null,null,null,null,null,null,null,null,null,null,null,null,null,null,"MERCEDES BENZ",15,"E320",6,"SEDAN"]
[null,null,null,null,null,null,null,null,null,null,null,null,null,null,null,null,null,null,null,null,null,null,null,null,null,null,null,null,null,null,null,"MERCEDES BENZ",15,"ML 320 (4X4)",7,"JEEP"]
[null,null,null,null,null,null,null,null,null,null,null,null,null,null,null,null,null,null,null,null,null,null,null,null,null,null,null,null,null,null,null,"MERCEDES BENZ",15,"ML 430 (4X4)",8,"JEEP"]
[null,null,null,null,null,null,null,null,null,null,null,null,null,null,null,null,null,null,null,null,null,null,null,null,null,null,null,null,null,null,null,"MERCEDES BENZ",15,"C230 KOMPRESOR",9,"SEDAN"]
[null,null,null,null,null,null,null,null,null,null,null,null,null,null,null,null,null,null,null,null,null,null,null,null,null,null,null,null,null,null,null,"MERCEDES BENZ",15,260,10,"SEDAN"]
[null,null,null,null,null,null,null,null,null,null,null,null,null,null,null,null,null,null,null,null,null,null,null,null,null,null,null,null,null,null,null,"MERCEDES BENZ",15,"SERIE G (4X4) 5P.",11,"SEDAN"]
[null,null,null,null,null,null,null,null,null,null,null,null,null,null,null,null,null,null,null,null,null,null,null,null,null,null,null,null,null,null,null,"MERCEDES BENZ",15,"C280 - 280",12,"SEDAN"]
[null,null,null,null,null,null,null,null,null,null,null,null,null,null,null,null,null,null,null,null,null,null,null,null,null,null,null,null,null,null,null,"MERCEDES BENZ",15,"200E",13,"SEDAN"]
[null,null,null,null,null,null,null,null,null,null,null,null,null,null,null,null,null,null,null,null,null,null,null,null,null,null,null,null,null,null,null,"MERCEDES BENZ",15,"280E",14,"SEDAN"]
[null,null,null,null,null,null,null,null,null,null,null,null,null,null,null,null,null,null,null,null,null,null,null,null,null,null,null,null,null,null,null,"MERCEDES BENZ",15,"250E",15,"SEDAN"]
[null,null,null,null,null,null,null,null,null,null,null,null,null,null,null,null,null,null,null,null,null,null,null,null,null,null,null,null,null,null,null,"MERCEDES BENZ",15,"260E",16,"SEDAN"]
[null,null,null,null,null,null,null,null,null,null,null,null,null,null,null,null,null,null,null,null,null,null,null,null,null,null,null,null,null,null,null,"MERCEDES BENZ",15,"300E",17,"SEDAN"]
[null,null,null,null,null,null,null,null,null,null,null,null,null,null,null,null,null,null,null,null,null,null,null,null,null,null,null,null,null,null,null,"MERCEDES BENZ",15,"C220",18,"SEDAN"]
[null,null,null,null,null,null,null,null,null,null,null,null,null,null,null,null,null,null,null,null,null,null,null,null,null,null,null,null,null,null,null,"MERCEDES BENZ",15,430,19,"SEDAN"]
[null,null,null,null,null,null,null,null,null,null,null,null,null,null,null,null,null,null,null,null,null,null,null,null,null,null,null,null,null,null,null,"MERCEDES BENZ",15,"230 F",20,"SEDAN"]
[null,null,null,null,null,null,null,null,null,null,null,null,null,null,null,null,null,null,null,null,null,null,null,null,null,null,null,null,null,null,null,"MERCEDES BENZ",15,"300SE",21,"SEDAN"]
[null,null,null,null,null,null,null,null,null,null,null,null,null,null,null,null,null,null,null,null,null,null,null,null,null,null,null,null,null,null,null,"MERCEDES BENZ",15,"C200",22,"SEDAN"]
[null,null,null,null,null,null,null,null,null,null,null,null,null,null,null,null,null,null,null,null,null,null,null,null,null,null,null,null,null,null,null,"MERCEDES BENZ",15,"SLK 230",23,"COUPE"]
[null,null,null,null,null,null,null,null,null,null,null,null,null,null,null,null,null,null,null,null,null,null,null,null,null,null,null,null,null,null,null,"MERCEDES BENZ",15,"C230",24,"SEDAN"]
[null,null,null,null,null,null,null,null,null,null,null,null,null,null,null,null,null,null,null,null,null,null,null,null,null,null,null,null,null,null,null,"MERCEDES BENZ",15,220,25,"SEDAN"]
[null,null,null,null,null,null,null,null,null,null,null,null,null,null,null,null,null,null,null,null,null,null,null,null,null,null,null,null,null,null,null,"MERCEDES BENZ",15,"230E",26,"SEDAN"]
[null,null,null,null,null,null,null,null,null,null,null,null,null,null,null,null,null,null,null,null,null,null,null,null,null,null,null,null,null,null,null,"MERCEDES BENZ",15,"500SEL",28,"SEDAN"]
[null,null,null,null,null,null,null,null,null,null,null,null,null,null,null,null,null,null,null,null,null,null,null,null,null,null,null,null,null,null,null,"MERCEDES BENZ",15,"240E",29,"SEDAN"]
[null,null,null,null,null,null,null,null,null,null,null,null,null,null,null,null,null,null,null,null,null,null,null,null,null,null,null,null,null,null,null,"MERCEDES BENZ",15,"ML 500",30,"SEDAN"]
[null,null,null,null,null,null,null,null,null,null,null,null,null,null,null,null,null,null,null,null,null,null,null,null,null,null,null,null,null,null,null,"MERCEDES BENZ",15,"C230K",31,"SEDAN"]
[null,null,null,null,null,null,null,null,null,null,null,null,null,null,null,null,null,null,null,null,null,null,null,null,null,null,null,null,null,null,null,"MERCEDES BENZ",15,"ML230",32,"JEEP"]
[null,null,null,null,null,null,null,null,null,null,null,null,null,null,null,null,null,null,null,null,null,null,null,null,null,null,null,null,null,null,null,"MERCEDES BENZ",15,"C180",35,"SEDAN"]
[null,null,null,null,null,null,null,null,null,null,null,null,null,null,null,null,null,null,null,null,null,null,null,null,null,null,null,null,null,null,null,"MERCEDES BENZ",15,"ML 350",37,"JEEP"]
[null,null,null,null,null,null,null,null,null,null,null,null,null,null,null,null,null,null,null,null,null,null,null,null,null,null,null,null,null,null,null,"MERCEDES BENZ",15,"CLK320",38,"SEDAN"]
[null,null,null,null,null,null,null,null,null,null,null,null,null,null,null,null,null,null,null,null,null,null,null,null,null,null,null,null,null,null,null,"MITSUBISHI",16,"L-200 4X2 C/S",1,"PICK-UP"]
[null,null,null,null,null,null,null,null,null,null,null,null,null,null,null,null,null,null,null,null,null,null,null,null,null,null,null,null,null,null,null,"MITSUBISHI",16,"L-200 4X2 D/C",2,"PICK-UP"]
[null,null,null,null,null,null,null,null,null,null,null,null,null,null,null,null,null,null,null,null,null,null,null,null,null,null,null,null,null,null,null,"MITSUBISHI",16,"L-200 4X4 C/S",3,"PICK-UP"]
[null,null,null,null,null,null,null,null,null,null,null,null,null,null,null,null,null,null,null,null,null,null,null,null,null,null,null,null,null,null,null,"MITSUBISHI",16,"L-200 4X4 D/C",4,"PICK-UP"]
[null,null,null,null,null,null,null,null,null,null,null,null,null,null,null,null,null,null,null,null,null,null,null,null,null,null,null,null,null,null,null,"MITSUBISHI",16,"LANCER",5,"SEDAN"]
[null,null,null,null,null,null,null,null,null,null,null,null,null,null,null,null,null,null,null,null,null,null,null,null,null,null,null,null,null,null,null,"MITSUBISHI",16,"SPACE WAGON 5P",6,"MINI VAN"]
[null,null,null,null,null,null,null,null,null,null,null,null,null,null,null,null,null,null,null,null,null,null,null,null,null,null,null,null,null,null,null,"MITSUBISHI",16,"MONTERO 3P",7,"JEEP"]
[null,null,null,null,null,null,null,null,null,null,null,null,null,null,null,null,null,null,null,null,null,null,null,null,null,null,null,null,null,null,null,"MITSUBISHI",16,"MONTERO 5P",8,"JEEP"]
[null,null,null,null,null,null,null,null,null,null,null,null,null,null,null,null,null,null,null,null,null,null,null,null,null,null,null,null,null,null,null,"MITSUBISHI",16,"MONTERO SPORT",9,"JEEP"]
[null,null,null,null,null,null,null,null,null,null,null,null,null,null,null,null,null,null,null,null,null,null,null,null,null,null,null,null,null,null,null,"MITSUBISHI",16,"GALANT",11,"SEDAN"]
[null,null,null,null,null,null,null,null,null,null,null,null,null,null,null,null,null,null,null,null,null,null,null,null,null,null,null,null,null,null,null,"MITSUBISHI",16,"ECLIPSE SPYDER",12,"COUPE"]
[null,null,null,null,null,null,null,null,null,null,null,null,null,null,null,null,null,null,null,null,null,null,null,null,null,null,null,null,null,null,null,"MITSUBISHI",16,"L300 C/D",14,"PICK-UP"]
[null,null,null,null,null,null,null,null,null,null,null,null,null,null,null,null,null,null,null,null,null,null,null,null,null,null,null,null,null,null,null,"MITSUBISHI",16,"L400 C/S",15,"PICK-UP"]
[null,null,null,null,null,null,null,null,null,null,null,null,null,null,null,null,null,null,null,null,null,null,null,null,null,null,null,null,null,null,null,"MITSUBISHI",16,"L400 D/C",16,"PICK-UP"]
[null,null,null,null,null,null,null,null,null,null,null,null,null,null,null,null,null,null,null,null,null,null,null,null,null,null,null,null,null,null,null,"MITSUBISHI",16,"MONTERO IO",17,"JEEP"]
[null,null,null,null,null,null,null,null,null,null,null,null,null,null,null,null,null,null,null,null,null,null,null,null,null,null,null,null,null,null,null,"MITSUBISHI",16,"OUTLANDER",18,"MINI VAN"]
[null,null,null,null,null,null,null,null,null,null,null,null,null,null,null,null,null,null,null,null,null,null,null,null,null,null,null,null,null,null,null,"NISSAN",17,"1200 P/U",1,"PICK-UP"]
[null,null,null,null,null,null,null,null,null,null,null,null,null,null,null,null,null,null,null,null,null,null,null,null,null,null,null,null,null,null,null,"NISSAN",17,"2400 C/S 4X2",2,"PICK-UP"]
[null,null,null,null,null,null,null,null,null,null,null,null,null,null,null,null,null,null,null,null,null,null,null,null,null,null,null,null,null,null,null,"NISSAN",17,"2400 D/C 4X2",3,"PICK-UP"]
[null,null,null,null,null,null,null,null,null,null,null,null,null,null,null,null,null,null,null,null,null,null,null,null,null,null,null,null,null,null,null,"NISSAN",17,"2400 D/C 4X4",4,"PICK-UP"]
[null,null,null,null,null,null,null,null,null,null,null,null,null,null,null,null,null,null,null,null,null,null,null,null,null,null,null,null,null,null,null,"NISSAN",17,"PATHFINDER",5,"JEEP"]
[null,null,null,null,null,null,null,null,null,null,null,null,null,null,null,null,null,null,null,null,null,null,null,null,null,null,null,null,null,null,null,"NISSAN",17,"PATHFINDER FULL",6,"JEEP"]
[null,null,null,null,null,null,null,null,null,null,null,null,null,null,null,null,null,null,null,null,null,null,null,null,null,null,null,null,null,null,null,"NISSAN",17,"PATROL 3P",7,"JEEP"]
[null,null,null,null,null,null,null,null,null,null,null,null,null,null,null,null,null,null,null,null,null,null,null,null,null,null,null,null,null,null,null,"NISSAN",17,"PATROL 5P",8,"JEEP"]
[null,null,null,null,null,null,null,null,null,null,null,null,null,null,null,null,null,null,null,null,null,null,null,null,null,null,null,null,null,null,null,"NISSAN",17,"SENTRA I",9,"SEDAN"]
[null,null,null,null,null,null,null,null,null,null,null,null,null,null,null,null,null,null,null,null,null,null,null,null,null,null,null,null,null,null,null,"NISSAN",17,"SENTRA II",10,"SEDAN"]
[null,null,null,null,null,null,null,null,null,null,null,null,null,null,null,null,null,null,null,null,null,null,null,null,null,null,null,null,null,null,null,"NISSAN",17,"ALMERA",11,"SEDAN"]
[null,null,null,null,null,null,null,null,null,null,null,null,null,null,null,null,null,null,null,null,null,null,null,null,null,null,null,null,null,null,null,"NISSAN",17,"ALTIMA",12,"SEDAN"]
[null,null,null,null,null,null,null,null,null,null,null,null,null,null,null,null,null,null,null,null,null,null,null,null,null,null,null,null,null,null,null,"NISSAN",17,"BLUEBIRD",14,"SEDAN"]
[null,null,null,null,null,null,null,null,null,null,null,null,null,null,null,null,null,null,null,null,null,null,null,null,null,null,null,null,null,null,null,"NISSAN",17,"INFINITY",19,"SEDAN"]
[null,null,null,null,null,null,null,null,null,null,null,null,null,null,null,null,null,null,null,null,null,null,null,null,null,null,null,null,null,null,null,"NISSAN",17,"LB120",21,"PICK-UP"]
[null,null,null,null,null,null,null,null,null,null,null,null,null,null,null,null,null,null,null,null,null,null,null,null,null,null,null,null,null,null,null,"NISSAN",17,"MAXIMA",22,"SEDAN"]
[null,null,null,null,null,null,null,null,null,null,null,null,null,null,null,null,null,null,null,null,null,null,null,null,null,null,null,null,null,null,null,"NISSAN",17,"PRIMERA",23,"SEDAN"]
[null,null,null,null,null,null,null,null,null,null,null,null,null,null,null,null,null,null,null,null,null,null,null,null,null,null,null,null,null,null,null,"NISSAN",17,"QUEST",24,"MINI VAN"]
[null,null,null,null,null,null,null,null,null,null,null,null,null,null,null,null,null,null,null,null,null,null,null,null,null,null,null,null,null,null,null,"NISSAN",17,"SUNNY",25,"SEDAN"]
[null,null,null,null,null,null,null,null,null,null,null,null,null,null,null,null,null,null,null,null,null,null,null,null,null,null,null,null,null,null,null,"NISSAN",17,"1800 C/S",27,"PICK-UP"]
[null,null,null,null,null,null,null,null,null,null,null,null,null,null,null,null,null,null,null,null,null,null,null,null,null,null,null,null,null,null,null,"NISSAN",17,"1800 D/C",28,"PICK-UP"]
[null,null,null,null,null,null,null,null,null,null,null,null,null,null,null,null,null,null,null,null,null,null,null,null,null,null,null,null,null,null,null,"NISSAN",17,"TERRANO",29,"JEEP"]
[null,null,null,null,null,null,null,null,null,null,null,null,null,null,null,null,null,null,null,null,null,null,null,null,null,null,null,null,null,null,null,"NISSAN",17,"X.TRAIL",30,"JEEP"]
[null,null,null,null,null,null,null,null,null,null,null,null,null,null,null,null,null,null,null,null,null,null,null,null,null,null,null,null,null,null,null,"NISSAN",17,"SENTRA SWA",31,"STATION WAGON"]
[null,null,null,null,null,null,null,null,null,null,null,null,null,null,null,null,null,null,null,null,null,null,null,null,null,null,null,null,null,null,null,"NISSAN",17,"2000 C/S",32,"PICK-UP"]
[null,null,null,null,null,null,null,null,null,null,null,null,null,null,null,null,null,null,null,null,null,null,null,null,null,null,null,null,null,null,null,"NISSAN",17,"PICKUP 4X2 D/C",33,"PICK-UP"]
[null,null,null,null,null,null,null,null,null,null,null,null,null,null,null,null,null,null,null,null,null,null,null,null,null,null,null,null,null,null,null,"NISSAN",17,"FRONTIER C/D 4X4",34,"PICK-UP"]
[null,null,null,null,null,null,null,null,null,null,null,null,null,null,null,null,null,null,null,null,null,null,null,null,null,null,null,null,null,null,null,"NISSAN",17,"MURANO",36,"JEEP"]
[null,null,null,null,null,null,null,null,null,null,null,null,null,null,null,null,null,null,null,null,null,null,null,null,null,null,null,null,null,null,null,"NISSAN",17,"FRONTIER C/D 4X2",37,"PICK-UP"]
[null,null,null,null,null,null,null,null,null,null,null,null,null,null,null,null,null,null,null,null,null,null,null,null,null,null,null,null,null,null,null,"NISSAN",17,"CLD 211 S",38,"PICK-UP"]
[null,null,null,null,null,null,null,null,null,null,null,null,null,null,null,null,null,null,null,null,null,null,null,null,null,null,null,null,null,null,null,"NISSAN",17,"PICKUP 4X2 C/S",39,"PICK-UP"]
[null,null,null,null,null,null,null,null,null,null,null,null,null,null,null,null,null,null,null,null,null,null,null,null,null,null,null,null,null,null,null,"OLDSMOBIL",73,"SILHOUETTE",1,"SEDAN"]
[null,null,null,null,null,null,null,null,null,null,null,null,null,null,null,null,null,null,null,null,null,null,null,null,null,null,null,null,null,null,null,"OLTCIT",40,"CLUB 12TRS",1,"SEDAN"]
[null,null,null,null,null,null,null,null,null,null,null,null,null,null,null,null,null,null,null,null,null,null,null,null,null,null,null,null,null,null,null,"PEUGEOT",18,"306 5P",1,"SEDAN"]
[null,null,null,null,null,null,null,null,null,null,null,null,null,null,null,null,null,null,null,null,null,null,null,null,null,null,null,null,null,null,null,"PEUGEOT",18,"206 3P",2,"COUPE"]
[null,null,null,null,null,null,null,null,null,null,null,null,null,null,null,null,null,null,null,null,null,null,null,null,null,null,null,null,null,null,null,"PEUGEOT",18,"206 5P",3,"SEDAN"]
[null,null,null,null,null,null,null,null,null,null,null,null,null,null,null,null,null,null,null,null,null,null,null,null,null,null,null,null,null,null,null,"PEUGEOT",18,"406 4P",4,"SEDAN"]
[null,null,null,null,null,null,null,null,null,null,null,null,null,null,null,null,null,null,null,null,null,null,null,null,null,null,null,null,null,null,null,"PEUGEOT",18,405,5,"SEDAN"]
[null,null,null,null,null,null,null,null,null,null,null,null,null,null,null,null,null,null,null,null,null,null,null,null,null,null,null,null,null,null,null,"PEUGEOT",18,305,6,"SEDAN"]
[null,null,null,null,null,null,null,null,null,null,null,null,null,null,null,null,null,null,null,null,null,null,null,null,null,null,null,null,null,null,null,"PEUGEOT",18,504,7,"SEDAN"]
[null,null,null,null,null,null,null,null,null,null,null,null,null,null,null,null,null,null,null,null,null,null,null,null,null,null,null,null,null,null,null,"PEUGEOT",18,505,8,"SEDAN"]
[null,null,null,null,null,null,null,null,null,null,null,null,null,null,null,null,null,null,null,null,null,null,null,null,null,null,null,null,null,null,null,"PEUGEOT",18,604,9,"SEDAN"]
[null,null,null,null,null,null,null,null,null,null,null,null,null,null,null,null,null,null,null,null,null,null,null,null,null,null,null,null,null,null,null,"PEUGEOT",18,605,10,"SEDAN"]
[null,null,null,null,null,null,null,null,null,null,null,null,null,null,null,null,null,null,null,null,null,null,null,null,null,null,null,null,null,null,null,"PEUGEOT",18,806,11,"SEDAN"]
[null,null,null,null,null,null,null,null,null,null,null,null,null,null,null,null,null,null,null,null,null,null,null,null,null,null,null,null,null,null,null,"PEUGEOT",18,"BERLINA",12,"SEDAN"]
[null,null,null,null,null,null,null,null,null,null,null,null,null,null,null,null,null,null,null,null,null,null,null,null,null,null,null,null,null,null,null,"PEUGEOT",18,404,13,"PICK-UP"]
[null,null,null,null,null,null,null,null,null,null,null,null,null,null,null,null,null,null,null,null,null,null,null,null,null,null,null,null,null,null,null,"PEUGEOT",18,"106 XR",14,"SEDAN"]
[null,null,null,null,null,null,null,null,null,null,null,null,null,null,null,null,null,null,null,null,null,null,null,null,null,null,null,null,null,null,null,"PEUGEOT",18,"BREAK",15,"SEDAN"]
[null,null,null,null,null,null,null,null,null,null,null,null,null,null,null,null,null,null,null,null,null,null,null,null,null,null,null,null,null,null,null,"PEUGEOT",18,1600,16,"PICK-UP"]
[null,null,null,null,null,null,null,null,null,null,null,null,null,null,null,null,null,null,null,null,null,null,null,null,null,null,null,null,null,null,null,"PEUGEOT",18,"BREAK 307",17,"SEDAN"]
[null,null,null,null,null,null,null,null,null,null,null,null,null,null,null,null,null,null,null,null,null,null,null,null,null,null,null,null,null,null,null,"PEUGEOT",18,"S16 3P",18,"COUPE"]
[null,null,null,null,null,null,null,null,null,null,null,null,null,null,null,null,null,null,null,null,null,null,null,null,null,null,null,null,null,null,null,"PEUGEOT",18,307,19,"SEDAN"]
[null,null,null,null,null,null,null,null,null,null,null,null,null,null,null,null,null,null,null,null,null,null,null,null,null,null,null,null,null,null,null,"PEUGEOT",18,"807 ST 2.0 AT",20,"SEDAN"]
[null,null,null,null,null,null,null,null,null,null,null,null,null,null,null,null,null,null,null,null,null,null,null,null,null,null,null,null,null,null,null,"PLYMOUTH",54,"VOYAGER",1,"MINI VAN"]
[null,null,null,null,null,null,null,null,null,null,null,null,null,null,null,null,null,null,null,null,null,null,null,null,null,null,null,null,null,null,null,"PLYMOUTH",54,"GRAND VOYAGER",3,"MINI VAN"]
[null,null,null,null,null,null,null,null,null,null,null,null,null,null,null,null,null,null,null,null,null,null,null,null,null,null,null,null,null,null,null,"PORCHE",56,"BOXSTER 986",1,"COUPE"]
[null,null,null,null,null,null,null,null,null,null,null,null,null,null,null,null,null,null,null,null,null,null,null,null,null,null,null,null,null,null,null,"PORCHE",56,"CAYENNE",2,"JEEP"]
[null,null,null,null,null,null,null,null,null,null,null,null,null,null,null,null,null,null,null,null,null,null,null,null,null,null,null,null,null,null,null,"RENAULT",19,"TWINGO",1,"COUPE"]
[null,null,null,null,null,null,null,null,null,null,null,null,null,null,null,null,null,null,null,null,null,null,null,null,null,null,null,null,null,null,null,"RENAULT",19,"CLIO",2,"SEDAN"]
[null,null,null,null,null,null,null,null,null,null,null,null,null,null,null,null,null,null,null,null,null,null,null,null,null,null,null,null,null,null,null,"RENAULT",19,"CLIO FULL",3,"SEDAN"]
[null,null,null,null,null,null,null,null,null,null,null,null,null,null,null,null,null,null,null,null,null,null,null,null,null,null,null,null,null,null,null,"RENAULT",19,"SCENIC",4,"SEDAN"]
[null,null,null,null,null,null,null,null,null,null,null,null,null,null,null,null,null,null,null,null,null,null,null,null,null,null,null,null,null,null,null,"RENAULT",19,"MEGANE",5,"SEDAN"]
[null,null,null,null,null,null,null,null,null,null,null,null,null,null,null,null,null,null,null,null,null,null,null,null,null,null,null,null,null,null,null,"RENAULT",19,"KANGOO",6,"STATION WAGON"]
[null,null,null,null,null,null,null,null,null,null,null,null,null,null,null,null,null,null,null,null,null,null,null,null,null,null,null,null,null,null,null,"RENAULT",19,"LAGUNA",7,"SEDAN"]
[null,null,null,null,null,null,null,null,null,null,null,null,null,null,null,null,null,null,null,null,null,null,null,null,null,null,null,null,null,null,null,"RENAULT",19,"19 TRICORPS",8,"SEDAN"]
[null,null,null,null,null,null,null,null,null,null,null,null,null,null,null,null,null,null,null,null,null,null,null,null,null,null,null,null,null,null,null,"RENAULT",19,"SYMBOL",9,"SEDAN"]
[null,null,null,null,null,null,null,null,null,null,null,null,null,null,null,null,null,null,null,null,null,null,null,null,null,null,null,null,null,null,null,"SAAB",45,900,1,"SEDAN"]
[null,null,null,null,null,null,null,null,null,null,null,null,null,null,null,null,null,null,null,null,null,null,null,null,null,null,null,null,null,null,null,"SAAB",45,950,2,"SEDAN"]
[null,null,null,null,null,null,null,null,null,null,null,null,null,null,null,null,null,null,null,null,null,null,null,null,null,null,null,null,null,null,null,"SAEHAN",57,"N/D",1,"SEDAN"]
[null,null,null,null,null,null,null,null,null,null,null,null,null,null,null,null,null,null,null,null,null,null,null,null,null,null,null,null,null,null,null,"SAMSUNG",74,"SV-110",1,"SEDAN"]
[null,null,null,null,null,null,null,null,null,null,null,null,null,null,null,null,null,null,null,null,null,null,null,null,null,null,null,null,null,null,null,"SANGYONG",42,"MUSSO",1,"JEEP"]
[null,null,null,null,null,null,null,null,null,null,null,null,null,null,null,null,null,null,null,null,null,null,null,null,null,null,null,null,null,null,null,"SANGYONG",42,"REXTON RX320",2,"JEEP"]
[null,null,null,null,null,null,null,null,null,null,null,null,null,null,null,null,null,null,null,null,null,null,null,null,null,null,null,null,null,null,null,"SEAT",105,"COUPE",1,"COUPE"]
[null,null,null,null,null,null,null,null,null,null,null,null,null,null,null,null,null,null,null,null,null,null,null,null,null,null,null,null,null,null,null,"SKODA",20,"FELICIA",1,"SEDAN"]
[null,null,null,null,null,null,null,null,null,null,null,null,null,null,null,null,null,null,null,null,null,null,null,null,null,null,null,null,null,null,null,"SKODA",20,"1300 PICK UP",2,"PICK-UP"]
[null,null,null,null,null,null,null,null,null,null,null,null,null,null,null,null,null,null,null,null,null,null,null,null,null,null,null,null,null,null,null,"SKODA",20,"FABIA",3,"SEDAN"]
[null,null,null,null,null,null,null,null,null,null,null,null,null,null,null,null,null,null,null,null,null,null,null,null,null,null,null,null,null,null,null,"SKODA",20,"OCTAVIA",4,"SEDAN"]
[null,null,null,null,null,null,null,null,null,null,null,null,null,null,null,null,null,null,null,null,null,null,null,null,null,null,null,null,null,null,null,"SKODA",20,"FAVORIT",5,"SEDAN"]
[null,null,null,null,null,null,null,null,null,null,null,null,null,null,null,null,null,null,null,null,null,null,null,null,null,null,null,null,null,null,null,"SKODA",20,"FORMAN",6,"SEDAN"]
[null,null,null,null,null,null,null,null,null,null,null,null,null,null,null,null,null,null,null,null,null,null,null,null,null,null,null,null,null,null,null,"SKODA",20,"SUPERB COMFORT",7,"SEDAN"]
[null,null,null,null,null,null,null,null,null,null,null,null,null,null,null,null,null,null,null,null,null,null,null,null,null,null,null,null,null,null,null,"SUBARU",58,"IMPREZA",1,"SEDAN"]
[null,null,null,null,null,null,null,null,null,null,null,null,null,null,null,null,null,null,null,null,null,null,null,null,null,null,null,null,null,null,null,"SUBARU",58,"LEGACY",2,"STATION WAGON"]
[null,null,null,null,null,null,null,null,null,null,null,null,null,null,null,null,null,null,null,null,null,null,null,null,null,null,null,null,null,null,null,"SUBARU",58,"GL10",3,"SEDAN"]
[null,null,null,null,null,null,null,null,null,null,null,null,null,null,null,null,null,null,null,null,null,null,null,null,null,null,null,null,null,null,null,"SUBARU",58,"A22L",4,"SEDAN"]
[null,null,null,null,null,null,null,null,null,null,null,null,null,null,null,null,null,null,null,null,null,null,null,null,null,null,null,null,null,null,null,"SUBARU",58,"FORESTER",5,"SEDAN"]
[null,null,null,null,null,null,null,null,null,null,null,null,null,null,null,null,null,null,null,null,null,null,null,null,null,null,null,null,null,null,null,"SUZUKI",60,"FORSA",11,"COUPE"]
[null,null,null,null,null,null,null,null,null,null,null,null,null,null,null,null,null,null,null,null,null,null,null,null,null,null,null,null,null,null,null,"SUZUKI",60,"GRAND VITARA",12,"JEEP"]
[null,null,null,null,null,null,null,null,null,null,null,null,null,null,null,null,null,null,null,null,null,null,null,null,null,null,null,null,null,null,null,"SUZUKI",60,"INTRUDER",13,"SEDAN"]
[null,null,null,null,null,null,null,null,null,null,null,null,null,null,null,null,null,null,null,null,null,null,null,null,null,null,null,null,null,null,null,"SUZUKI",60,"SAMURAI",16,"JEEP"]
[null,null,null,null,null,null,null,null,null,null,null,null,null,null,null,null,null,null,null,null,null,null,null,null,null,null,null,null,null,null,null,"SUZUKI",60,"SIDERICK",17,"JEEP"]
[null,null,null,null,null,null,null,null,null,null,null,null,null,null,null,null,null,null,null,null,null,null,null,null,null,null,null,null,null,null,null,"SUZUKI",60,"SJ 413",18,"JEEP"]
[null,null,null,null,null,null,null,null,null,null,null,null,null,null,null,null,null,null,null,null,null,null,null,null,null,null,null,null,null,null,null,"SUZUKI",60,"VITARA",22,"JEEP"]
[null,null,null,null,null,null,null,null,null,null,null,null,null,null,null,null,null,null,null,null,null,null,null,null,null,null,null,null,null,null,null,"SUZUKI",60,"LJ80",29,"JEEP"]
[null,null,null,null,null,null,null,null,null,null,null,null,null,null,null,null,null,null,null,null,null,null,null,null,null,null,null,null,null,null,null,"SUZUKI",60,"JIMNY 4X4",30,"JEEP"]
[null,null,null,null,null,null,null,null,null,null,null,null,null,null,null,null,null,null,null,null,null,null,null,null,null,null,null,null,null,null,null,"TALBOT",59,"ORIZONT",1,"SEDAN"]
[null,null,null,null,null,null,null,null,null,null,null,null,null,null,null,null,null,null,null,null,null,null,null,null,null,null,null,null,null,null,null,"TATA",75,"SAFARI",2,"JEEP"]
[null,null,null,null,null,null,null,null,null,null,null,null,null,null,null,null,null,null,null,null,null,null,null,null,null,null,null,null,null,null,null,"TATA",75,"INDICA",3,"SEDAN"]
[null,null,null,null,null,null,null,null,null,null,null,null,null,null,null,null,null,null,null,null,null,null,null,null,null,null,null,null,null,null,null,"TOYOTA",21,"TERCEL",1,"SEDAN"]
[null,null,null,null,null,null,null,null,null,null,null,null,null,null,null,null,null,null,null,null,null,null,null,null,null,null,null,null,null,null,null,"TOYOTA",21,"YARIS",2,"SEDAN"]
[null,null,null,null,null,null,null,null,null,null,null,null,null,null,null,null,null,null,null,null,null,null,null,null,null,null,null,null,null,null,null,"TOYOTA",21,"YARIS HATCHBACK 1.3",3,"STATION WAGON"]
[null,null,null,null,null,null,null,null,null,null,null,null,null,null,null,null,null,null,null,null,null,null,null,null,null,null,null,null,null,null,null,"TOYOTA",21,"COROLLA",4,"SEDAN"]
[null,null,null,null,null,null,null,null,null,null,null,null,null,null,null,null,null,null,null,null,null,null,null,null,null,null,null,null,null,null,null,"TOYOTA",21,"STOUT II",5,"PICK-UP"]
[null,null,null,null,null,null,null,null,null,null,null,null,null,null,null,null,null,null,null,null,null,null,null,null,null,null,null,null,null,null,null,"TOYOTA",21,"STOUT 2200 CHASIS",6,"PICK-UP"]
[null,null,null,null,null,null,null,null,null,null,null,null,null,null,null,null,null,null,null,null,null,null,null,null,null,null,null,null,null,null,null,"TOYOTA",21,"HILUX C/S 2.4 4X2",7,"PICK-UP"]
[null,null,null,null,null,null,null,null,null,null,null,null,null,null,null,null,null,null,null,null,null,null,null,null,null,null,null,null,null,null,null,"TOYOTA",21,"HILUX D/C 2.4 4X2",8,"PICK-UP"]
[null,null,null,null,null,null,null,null,null,null,null,null,null,null,null,null,null,null,null,null,null,null,null,null,null,null,null,null,null,null,null,"TOYOTA",21,"HILUX D/C 2.4 4X4",9,"PICK-UP"]
[null,null,null,null,null,null,null,null,null,null,null,null,null,null,null,null,null,null,null,null,null,null,null,null,null,null,null,null,null,null,null,"TOYOTA",21,"HILUX D/C 2.4 4X4 FULL",10,"PICK-UP"]
[null,null,null,null,null,null,null,null,null,null,null,null,null,null,null,null,null,null,null,null,null,null,null,null,null,null,null,null,null,null,null,"TOYOTA",21,"LAND CRUSIER 3P",11,"JEEP"]
[null,null,null,null,null,null,null,null,null,null,null,null,null,null,null,null,null,null,null,null,null,null,null,null,null,null,null,null,null,null,null,"TOYOTA",21,"LAND CRUSIER 5P",12,"JEEP"]
[null,null,null,null,null,null,null,null,null,null,null,null,null,null,null,null,null,null,null,null,null,null,null,null,null,null,null,null,null,null,null,"TOYOTA",21,"LAND CRUSIER PRADO 3P",13,"JEEP"]
[null,null,null,null,null,null,null,null,null,null,null,null,null,null,null,null,null,null,null,null,null,null,null,null,null,null,null,null,null,null,null,"TOYOTA",21,"LAND CRUSIER PRADO 5P",14,"JEEP"]
[null,null,null,null,null,null,null,null,null,null,null,null,null,null,null,null,null,null,null,null,null,null,null,null,null,null,null,null,null,null,null,"TOYOTA",21,"4 RUNNER",15,"JEEP"]
[null,null,null,null,null,null,null,null,null,null,null,null,null,null,null,null,null,null,null,null,null,null,null,null,null,null,null,null,null,null,null,"TOYOTA",21,"RAV4 3P",16,"JEEP"]
[null,null,null,null,null,null,null,null,null,null,null,null,null,null,null,null,null,null,null,null,null,null,null,null,null,null,null,null,null,null,null,"TOYOTA",21,"RAV4 5P",17,"JEEP"]
[null,null,null,null,null,null,null,null,null,null,null,null,null,null,null,null,null,null,null,null,null,null,null,null,null,null,null,null,null,null,null,"TOYOTA",21,"CAMRY",20,"SEDAN"]
[null,null,null,null,null,null,null,null,null,null,null,null,null,null,null,null,null,null,null,null,null,null,null,null,null,null,null,null,null,null,null,"TOYOTA",21,"CORONA",21,"SEDAN"]
[null,null,null,null,null,null,null,null,null,null,null,null,null,null,null,null,null,null,null,null,null,null,null,null,null,null,null,null,null,null,null,"TOYOTA",21,"CRESSIDA",22,"SEDAN"]
[null,null,null,null,null,null,null,null,null,null,null,null,null,null,null,null,null,null,null,null,null,null,null,null,null,null,null,null,null,null,null,"TOYOTA",21,"CROWN",23,"SEDAN"]
[null,null,null,null,null,null,null,null,null,null,null,null,null,null,null,null,null,null,null,null,null,null,null,null,null,null,null,null,null,null,null,"TOYOTA",21,"TACOMA",26,"STATION WAGON"]
[null,null,null,null,null,null,null,null,null,null,null,null,null,null,null,null,null,null,null,null,null,null,null,null,null,null,null,null,null,null,null,"TOYOTA",21,"STOUT C/S",27,"PICK-UP"]
[null,null,null,null,null,null,null,null,null,null,null,null,null,null,null,null,null,null,null,null,null,null,null,null,null,null,null,null,null,null,null,"TOYOTA",21,800,28,"PICK-UP"]
[null,null,null,null,null,null,null,null,null,null,null,null,null,null,null,null,null,null,null,null,null,null,null,null,null,null,null,null,null,null,null,"TOYOTA",21,"HILUX C/S 2.4 4X4",29,"PICK-UP"]
[null,null,null,null,null,null,null,null,null,null,null,null,null,null,null,null,null,null,null,null,null,null,null,null,null,null,null,null,null,null,null,"TOYOTA",21,"LAND CRUISER FZJ C/S",30,"PICK-UP"]
[null,null,null,null,null,null,null,null,null,null,null,null,null,null,null,null,null,null,null,null,null,null,null,null,null,null,null,null,null,null,null,"TOYOTA",21,"HIGHLANDER",32,"JEEP"]
[null,null,null,null,null,null,null,null,null,null,null,null,null,null,null,null,null,null,null,null,null,null,null,null,null,null,null,null,null,null,null,"TOYOTA",21,"1000 P/U",35,"PICK-UP"]
[null,null,null,null,null,null,null,null,null,null,null,null,null,null,null,null,null,null,null,null,null,null,null,null,null,null,null,null,null,null,null,"TOYOTA",21,"YARIS SPORT",36,"SEDAN"]
[null,null,null,null,null,null,null,null,null,null,null,null,null,null,null,null,null,null,null,null,null,null,null,null,null,null,null,null,null,null,null,"TOYOTA",21,"NITRO 3P",37,"COUPE"]
[null,null,null,null,null,null,null,null,null,null,null,null,null,null,null,null,null,null,null,null,null,null,null,null,null,null,null,null,null,null,null,"VOLKSWAGEN",22,"GOL 3P",1,"COUPE"]
[null,null,null,null,null,null,null,null,null,null,null,null,null,null,null,null,null,null,null,null,null,null,null,null,null,null,null,null,null,null,null,"VOLKSWAGEN",22,"GOL 5P",2,"SEDAN"]
[null,null,null,null,null,null,null,null,null,null,null,null,null,null,null,null,null,null,null,null,null,null,null,null,null,null,null,null,null,null,null,"VOLKSWAGEN",22,"GOL SPORT",3,"SEDAN"]
[null,null,null,null,null,null,null,null,null,null,null,null,null,null,null,null,null,null,null,null,null,null,null,null,null,null,null,null,null,null,null,"VOLKSWAGEN",22,"SAVEIRO",4,"PICK-UP"]
[null,null,null,null,null,null,null,null,null,null,null,null,null,null,null,null,null,null,null,null,null,null,null,null,null,null,null,null,null,null,null,"VOLKSWAGEN",22,"GOLF",5,"SEDAN"]
[null,null,null,null,null,null,null,null,null,null,null,null,null,null,null,null,null,null,null,null,null,null,null,null,null,null,null,null,null,null,null,"VOLKSWAGEN",22,"POLO HATCHBACK",6,"STATION WAGON"]
[null,null,null,null,null,null,null,null,null,null,null,null,null,null,null,null,null,null,null,null,null,null,null,null,null,null,null,null,null,null,null,"VOLKSWAGEN",22,"POLO",7,"SEDAN"]
[null,null,null,null,null,null,null,null,null,null,null,null,null,null,null,null,null,null,null,null,null,null,null,null,null,null,null,null,null,null,null,"VOLKSWAGEN",22,"JETTA 4P",8,"SEDAN"]
[null,null,null,null,null,null,null,null,null,null,null,null,null,null,null,null,null,null,null,null,null,null,null,null,null,null,null,null,null,null,null,"VOLKSWAGEN",22,"VENTO",9,"SEDAN"]
[null,null,null,null,null,null,null,null,null,null,null,null,null,null,null,null,null,null,null,null,null,null,null,null,null,null,null,null,null,null,null,"VOLKSWAGEN",22,"PARATI",10,"SEDAN"]
[null,null,null,null,null,null,null,null,null,null,null,null,null,null,null,null,null,null,null,null,null,null,null,null,null,null,null,null,null,null,null,"VOLKSWAGEN",22,"SANTANA 4P",11,"SEDAN"]
[null,null,null,null,null,null,null,null,null,null,null,null,null,null,null,null,null,null,null,null,null,null,null,null,null,null,null,null,null,null,null,"VOLKSWAGEN",22,"AMAZON",12,"SEDAN"]
[null,null,null,null,null,null,null,null,null,null,null,null,null,null,null,null,null,null,null,null,null,null,null,null,null,null,null,null,null,null,null,"VOLKSWAGEN",22,"BRASILIA",13,"SEDAN"]
[null,null,null,null,null,null,null,null,null,null,null,null,null,null,null,null,null,null,null,null,null,null,null,null,null,null,null,null,null,null,null,"VOLKSWAGEN",22,"ESCARABAJO",15,"COUPE"]
[null,null,null,null,null,null,null,null,null,null,null,null,null,null,null,null,null,null,null,null,null,null,null,null,null,null,null,null,null,null,null,"VOLKSWAGEN",22,"POLO SPORT",17,"SEDAN"]
[null,null,null,null,null,null,null,null,null,null,null,null,null,null,null,null,null,null,null,null,null,null,null,null,null,null,null,null,null,null,null,"VOLKSWAGEN",22,"QUAMTUM",18,"STATION WAGON"]
[null,null,null,null,null,null,null,null,null,null,null,null,null,null,null,null,null,null,null,null,null,null,null,null,null,null,null,null,null,null,null,"VOLKSWAGEN",22,"PASSAT",19,"SEDAN"]
[null,null,null,null,null,null,null,null,null,null,null,null,null,null,null,null,null,null,null,null,null,null,null,null,null,null,null,null,null,null,null,"VOLKSWAGEN",22,"GOLF GTI",20,"COUPE"]
[null,null,null,null,null,null,null,null,null,null,null,null,null,null,null,null,null,null,null,null,null,null,null,null,null,null,null,null,null,null,null,"VOLKSWAGEN",22,"BETTLE",21,"COUPE"]
[null,null,null,null,null,null,null,null,null,null,null,null,null,null,null,null,null,null,null,null,null,null,null,null,null,null,null,null,null,null,null,"VOLKSWAGEN",22,"BORA",22,"SEDAN"]
[null,null,null,null,null,null,null,null,null,null,null,null,null,null,null,null,null,null,null,null,null,null,null,null,null,null,null,null,null,null,null,"VOLKSWAGEN",22,"FOX SPORT",23,"SEDAN"]
[null,null,null,null,null,null,null,null,null,null,null,null,null,null,null,null,null,null,null,null,null,null,null,null,null,null,null,null,null,null,null,"VOLKSWAGEN",22,"FOX 2P",24,"COUPE"]
[null,null,null,null,null,null,null,null,null,null,null,null,null,null,null,null,null,null,null,null,null,null,null,null,null,null,null,null,null,null,null,"VOLKSWAGEN",22,"FOX 4P",25,"SEDAN"]
[null,null,null,null,null,null,null,null,null,null,null,null,null,null,null,null,null,null,null,null,null,null,null,null,null,null,null,null,null,null,null,"VOLVO",23,460,1,"SEDAN"]
[null,null,null,null,null,null,null,null,null,null,null,null,null,null,null,null,null,null,null,null,null,null,null,null,null,null,null,null,null,null,null,"VOLVO",23,"V70",2,"SEDAN"]
[null,null,null,null,null,null,null,null,null,null,null,null,null,null,null,null,null,null,null,null,null,null,null,null,null,null,null,null,null,null,null,"VOLVO",23,"S60",3,"SEDAN"]
[null,null,null,null,null,null,null,null,null,null,null,null,null,null,null,null,null,null,null,null,null,null,null,null,null,null,null,null,null,null,null,"VOLVO",23,240,4,"SEDAN"]
[null,null,null,null,null,null,null,null,null,null,null,null,null,null,null,null,null,null,null,null,null,null,null,null,null,null,null,null,null,null,null,"VOLVO",23,850,5,"SEDAN"]
[null,null,null,null,null,null,null,null,null,null,null,null,null,null,null,null,null,null,null,null,null,null,null,null,null,null,null,null,null,null,null,"VOLVO",23,240,6,"SEDAN"]
[null,null,null,null,null,null,null,null,null,null,null,null,null,null,null,null,null,null,null,null,null,null,null,null,null,null,null,null,null,null,null,"VOLVO",23,"122 S",7,"SEDAN"]
[null,null,null,null,null,null,null,null,null,null,null,null,null,null,null,null,null,null,null,null,null,null,null,null,null,null,null,null,null,null,null,"VOLVO",23,244,8,"SEDAN"]
[null,null,null,null,null,null,null,null,null,null,null,null,null,null,null,null,null,null,null,null,null,null,null,null,null,null,null,null,null,null,null,"VOLVO",23,"940 GL",9,"SEDAN"]
[null,null,null,null,null,null,null,null,null,null,null,null,null,null,null,null,null,null,null,null,null,null,null,null,null,null,null,null,null,null,null,"VOLVO",23,"430SE",10,"SEDAN"]
[null,null,null,null,null,null,null,null,null,null,null,null,null,null,null,null,null,null,null,null,null,null,null,null,null,null,null,null,null,null,null,"VOLVO",23,440,11,"SEDAN"]
[null,null,null,null,null,null,null,null,null,null,null,null,null,null,null,null,null,null,null,null,null,null,null,null,null,null,null,null,null,null,null,"VOLVO",23,740,12,"SEDAN"]
[null,null,null,null,null,null,null,null,null,null,null,null,null,null,null,null,null,null,null,null,null,null,null,null,null,null,null,null,null,null,null,"VOLVO",23,960,13,"SEDAN"]
[null,null,null,null,null,null,null,null,null,null,null,null,null,null,null,null,null,null,null,null,null,null,null,null,null,null,null,null,null,null,null,"VOLVO",23,760,14,"SEDAN"]
[null,null,null,null,null,null,null,null,null,null,null,null,null,null,null,null,null,null,null,null,null,null,null,null,null,null,null,null,null,null,null,"VOLVO",23,"S40",15,"SEDAN"]
[null,null,null,null,null,null,null,null,null,null,null,null,null,null,null,null,null,null,null,null,null,null,null,null,null,null,null,null,null,null,null,"VOLVO",23,"S80",16,"SEDAN"]
[null,null,null,null,null,null,null,null,null,null,null,null,null,null,null,null,null,null,null,null,null,null,null,null,null,null,null,null,null,null,null,"VOLVO",23,"S70",17,"SEDAN"]
[null,null,null,null,null,null,null,null,null,null,null,null,null,null,null,null,null,null,null,null,null,null,null,null,null,null,null,null,null,null,null,"VOLVO",23,"S90",19,"SEDAN"]
[null,null,null,null,null,null,null,null,null,null,null,null,null,null,null,null,null,null,null,null,null,null,null,null,null,null,null,null,null,null,null,"WORLDSTAR",99,"1300 CC",1,"PICK-UP"]
[null,null,null,null,null,null,null,null,null,null,null,null,null,null,null,null,null,null,null,null,null,null,null,null,null,null,null,null,null,null,null,"ZASTAVA",61,"SEDAN",1,"SEDAN"]
[null,null,null,null,null,null,null,null,null,null,null,null,null,null,null,null,null,null,null,null,null,null,null,null,null,null,null,null,null,null,null,"ZASTAVA",61,1100,2,"SEDAN"]
[null,null,null,null,null,null,null,null,null,null,null,null,null,null,null,"V2 - Producto Empresas"]
[null,null,null," ",null,null,null,null,null,null,null,null,null,null,null,"Elaborado por: Hans Andrade "]
[null,null,null,null,null,null,null,null,null,null,null,null,null,null,null,"Actualizado Por: Gabriela Báez"]
[null,null,null,null,null,null,null,null,null,null,null,null,null,null,null,"Fecha: 29/07/2024"]

{"sheet":"FORM","index":6,"n_rows":769,"n_cols":52,"rows_kept":769,"cut":false,"hidden":false,"merged":[[65,2,65,3],[63,2,63,3],[65,11,65,14],[67,2,67,3],[61,2,61,14],[73,5,73,14],[65,5,65,8],[63,5,63,8],[81,5,81,14],[79,2,79,3],[79,5,79,14],[75,2,75,14],[77,5,77,14],[84,2,84,3],[92,5,92,14],[98,5,98,14],[86,2,86,3],[86,5,86,14],[90,5,90,14],[100,2,100,3],[96,2,96,3],[100,5,100,14],[84,5,84,14],[49,5,49,14],[104,2,104,3],[94,2,94,3],[94,5,94,14],[90,2,90,3],[49,2,49,3],[71,2,71,3],[71,5,71,14],[57,2,57,3],[57,5,57,14],[59,2,59,3],[59,5,59,14],[69,5,69,14],[69,2,69,3],[77,2,77,3],[63,11,63,14],[96,5,96,14],[104,5,104,14],[98,2,98,3],[102,5,102,14],[73,2,73,3],[81,2,81,3],[67,5,67,14],[53,5,53,14],[6,2,6,14],[31,2,31,14],[13,2,13,3],[13,5,13,14],[25,2,25,3],[17,2,17,3],[25,5,25,14],[29,2,29,3],[23,5,23,14],[27,2,27,3],[27,5,27,14],[23,2,23,3],[8,2,8,3],[21,2,21,3],[21,5,21,14],[11,2,11,14],[19,5,19,14],[17,5,17,14],[15,2,15,3],[15,5,15,14],[19,2,19,3],[29,5,29,14],[39,5,39,14],[45,2,45,3],[41,2,41,3],[41,5,41,14],[51,2,51,3],[55,2,55,3],[55,5,55,14],[37,11,37,14],[33,5,33,8],[35,5,35,8],[37,5,37,8],[37,2,37,3],[35,11,35,14],[33,2,33,3],[35,2,35,3],[45,5,45,14],[39,2,39,3],[43,2,43,3],[43,5,43,14],[47,2,47,3],[33,11,33,14],[53,2,53,3],[47,5,47,14],[51,5,51,14],[161,5,161,8],[140,2,140,3],[142,2,142,3],[108,2,108,3],[126,8,126,9],[126,11,126,12],[126,2,126,3],[123,11,123,12],[125,8,125,9],[124,5,124,6],[124,8,124,9],[132,2,132,3],[132,5,132,14],[125,2,125,3],[134,2,134,3],[123,2,123,3],[124,2,124,3],[122,5,122,6],[108,5,108,14],[116,5,116,14],[123,5,123,6],[120,2,120,3],[122,2,122,3],[120,5,120,6],[152,5,152,8],[144,2,144,14],[150,2,150,3],[150,5,150,8],[150,11,150,14],[152,2,152,3],[92,2,92,3],[88,2,88,3],[88,5,88,14],[122,8,122,9],[123,8,123,9],[120,11,120,12],[116,2,116,3],[112,2,112,3],[112,5,112,14],[114,2,114,3],[114,5,114,14],[118,2,118,14],[122,11,122,12],[102,2,102,3],[138,5,138,14],[126,5,126,6],[124,11,124,12],[130,5,130,14],[343,2,343,3],[170,2,170,3],[171,70,171,76],[172,70,172,76],[173,70,173,76],[174,70,174,76],[175,70,175,76],[176,70,176,76],[177,70,177,76],[338,2,338,3],[106,2,106,3],[120,8,120,9],[146,2,146,3],[148,5,148,6],[148,11,148,14],[142,5,142,14],[130,2,130,3],[128,2,128,14],[146,5,146,14],[138,2,138,3],[140,5,140,14],[136,2,136,3],[136,5,136,14],[125,11,125,12],[134,5,134,14],[125,5,125,6],[106,5,106,14]]}
[]
[]
[null,null,null,null,null,null,"FINANCIAMIENTO VEHICULAR"]
[]
[null,null,null,null,null,null,"SOLICITUD"]
[]
[]
[]
[null,null,"FECHA DE COMPRA / VENTA:",null,null,{"$f":"+COTIZADOR!F10","v":"2025-02-07"},"AAAA/MM/DD",null," "]
[null,null,null,null,null,null,null,null,null,null," "]
[]
[null,null,"DATOS DEL CONCESIONARIO"]
[]
[null,null,"CONCESIONARIO:",null,null,"CONCESIONARIO"]
[]
[null,null,"REPRESENTANTE LEGAL:",null,null,"FABIAN VARGAS"]
[]
[null,null,"NACIONALIDAD DEL REPRESENTANTE LEGAL:",null,null,"ECUATORIANO"]
[]
[null,null,"CARGO:",null,null,"GERENTE GENERAL"]
[]
[null,null,"RUC:",null,null,"XXXXXXXXXX001"]
[]
[null,null,"DIRECCIÓN:",null,null,"AV 10 DE AGOSTO Y AV GASPAR DE VILLAROEL ESQUINA"]
[]
[null,null,"CIUDAD:",null,null,"GUAYAQUIL"]
[]
[null,null,"NOMBRES Y APELLIDOS DEL VENDEDOR:",null,null,{"$f":"COTIZADOR!$F$14","v":"NOMBRE Y APELLIDO"}]
[]
[null,null,"CÉDULA DEL VENDEDOR:",null,null,"XXXXXXXXXX"]
[]
[null,null,"DATOS DEL CLIENTE"]
[]
[null,null,"APELLIDOS:",null,null,{"$f":"COTIZADOR!$F$18","v":"PRIMER APELLIDO"},null,null,null,null,null,{"$f":"IF(COTIZADOR!L18=0,\" \",COTIZADOR!L18)","v":"SEGUNDO APELLIDO"},null,null,null,null,{"$f":"IF(L34=0,F34,CONCATENATE(F34,\" \",L34))","v":"PRIMER APELLIDO SEGUNDO APELLIDO"}]
[null,null,null,null,null,null,null,null,null,null,null,null,null,null,null,null," "]
[null,null,"NOMBRES:",null,null,{"$f":"COTIZADOR!$F$20","v":"PRIMER NOMBRE"},null,null,null,null,null,{"$f":"IF(COTIZADOR!L20=0,\" \",COTIZADOR!L20)","v":"SEGUNDO NOMBRE"},null,null,null,null,{"$f":"IF(L36=0,F36,CONCATENATE(F36,\" \",L36))","v":"PRIMER NOMBRE SEGUNDO NOMBRE"}]
[]
[null,null,"TELEFONOS:",null,null,{"$f":"COTIZADOR!$F$22","v":"CELULAR"},null,null,null,null,null,{"$f":"COTIZADOR!$L$22","v":"CONVENCIONAL"},null,null,null,null,{"$f":"CONCATENATE(Q36,\" \",Q34)","v":"PRIMER NOMBRE SEGUNDO NOMBRE PRIMER APELLIDO SEGUNDO APELLIDO"}]
[]
[null,null,"No. DE IDENTIFICACION:",null,null,"XXXXXXXXXX"]
[]
[null,null,"NACIONALIDAD DEL CLIENTE:",null,null,"ECUATORIANA"]
[]
[null,null,"GENERO:",null,null,"MASCULINO"]
[]
[null,null,"DIRECCION:",null,null,"CARCELEN"]
[]
[null,null,"CIUDAD:",null,null,"GUAYAQUIL"]
[]
[null,null,"E-MAIL:",null,null,"Correo"]
[]
[null,null,"LUGAR DE TRABAJO:",null,null,"QUITO"]
[]
[null,null,"DIRECCIÓN  DE TRABAJO:",null,null,"AMAZONAS Y AYORA"]
[]
[null,null,"TELEFONO  DE TRABAJO:",null,null,"022000000"]
[]
[null,null,"PROFESIÓN U OCUPACIÓN:",null,null,"INGENIERO"]
[]
[null,null,"EL VEHÍCULO ES DE ÚNICO USO FAMILIAR O PERSONAL:",null,null,"Si"]
[]
[null,null,"DATOS INFORMATIVOS DEL CONYUGE"]
[]
[null,null,"APELLIDOS:",null,null,null,null,null,null,null,null,null,null,null,null,null,{"$f":"IF(L64=0,F64,CONCATENATE(F64,\" \",L64))","v":0}]
[null,null,null,null,null,null,null,null,null,null,null,null,null,null,null,null," "]
[null,null,"NOMBRES:",null,null,null,null,null,null,null,null,null,null,null,null,null,{"$f":"IF(L66=0,F66,CONCATENATE(F66,\" \",L66))","v":0}]
[]
[null,null,"No. CEDULA / RUC:",null,null,null,null,null,null,null,null,null,null,null,null,null," "]
[]
[null,null,"NACIONALIDAD DEL CONYUGUE:"]
[]
[null,null,"LUGAR DE TRABAJO:"]
[]
[null,null,"PROFESIÓN U OCUPACIÓN:"]
[]
[null,null,"DATOS VEHÍCULO"]
[]
[null,null,"MARCA:",null,null,"HYUNDAI"]
[]
[null,null,"MODELO:",null,null,"ACCENT"]
[]
[null,null,"CLASE:",null,null,"AUTOMOVIL"]
[]
[]
[null,null,"TIPO:",null,null,"SEDAN"]
[]
[null,null,"AÑO:",null,null,"2022"]
[]
[null,null,"COLOR:",null,null,"ROJO"]
[]
[null,null,"No. DE MOTOR:",null,null,"BU456792826RE7"]
[]
[null,null,"No. DE CHASIS:",null,null,"CG5342892U"]
[]
[null,null,"PAIS DE ORIGEN:",null,null,"KOREA"]
[]
[null,null,"TONELAJE:",null,null,"0,45"]
[]
[null,null,"CILINDRAJE:",null,null,"2000"]
[]
[null,null,"VALOR DE FINANCIAMIENTO DEL VEHICULO:",null,null,{"$f":"COTIZADOR!F34","v":10000}]
[]
[null,null,"VALOR DE ENTRADA",null,null,{"$f":"COTIZADOR!F41","v":0}]
[]
[null,null,"PLAZO FINANCIAMIENTO (Meses)",null,null,{"$f":"COTIZADOR!F42","v":24}]
[]
[null,null,"TASA DE INTERES VIGENTE:",null,null,{"$f":"+COTIZADOR!F48","v":0.156}]
[]
[null,null,"CUOTA VEHICULO:",null,null,{"$f":"+'TABLA AMORT.'!C14","v":488.72375364369611}]
[]
[null,null,"REQUIERE DISPOSITIVO",null,null,{"$f":"IF(F101>15000,\"REQUIERE DISPOSITIVO DE RASTREO\",\"NO APLICA DISPOSITIVO\")","v":"NO APLICA DISPOSITIVO"}]
[]
[null,null,"DISPOSITIVO",null,null,{"$f":"COTIZADOR!F51","v":"Con dispositivo Concesionario"}]
[]
[null,null,"DISPOSITIVO",null,null,{"$f":"CONCATENATE(F113,\" \",IF(F105<=12,12,IF(AND(F105>12,F105<=24),24,IF(AND(F105>24,F105<=36),36,IF(AND(F105>36,F105<=48),48,60)))))","v":"Con dispositivo Concesionario 24"}]
[]
[null,null,"GASTOS LEGALIZACIÓN",null,null,{"$f":"+COTIZADOR!F57","v":527.71499999999992}]
[]
[null,null,"CONDUCTORES DEL VEHICULO"]
[]
[null,null,"NOMBRE Y APELLIDO",null,null,"FECHA NACIMIENTO",null,null,"GENERO",null,null,"ESTADO CIVIL",null,null,"% DE USO"]
[]
[]
[]
[]
[]
[]
[]
[null,null,"VALORES ADICIONALES",null,null,null,null,null,null,null,null,null,null,null,null,null," "]
[]
[null,null,"CUOTA MENSUAL SEGURO VEHICULAR PRIMER AÑO",null,null,{"$f":"+COTIZADOR!F55","v":125.58383333333335}]
[]
[null,null,"GASTOS LEGALES",null,null,{"$f":"FIDEVAL!C8","v":527.71499999999992}]
[]
[null,null,"PLAZO GASTOS LEGALES",null,null,{"$f":"COTIZADOR!F53","v":"CORRIENTE"}]
[]
[null,null,"CUOTA GASTOS LEGALES",null,null,{"$f":"+COTIZADOR!F57","v":527.71499999999992}]
[]
[null,null,"CUOTA MENSUAL RASTREO SATELITAL",null,null,{"$f":"IF(F113=\"Con dispositivo Concesionario\",0,VLOOKUP(F115,COTIZADOR!$C$87:$D$131,2,FALSE))","v":0}]
[]
[null,null,"CUOTA MENSUAL SEGURO DESGRAVAMEN",null,null,"0,099% MENSUAL SOBRE EL SALDO DE LA TARJETA DE CREDITO"]
[]
[null,null,"CUOTA MENSUAL FINANCIAMIENTO VEHICULO",null,null,{"$f":"+F109","v":488.72375364369611}]
[]
[null,null,"FORMA DE PAGO"]
[]
[null,null,"No. DE TARJETA ENCRIPTADA:",null,null,"XXXXXXXXXX1234"]
[]
[]
[]
[null,null,"No. DE TARJETA:",null,null,360860,null,null,null,null,null,"1234567890"]
[]
[null,null,"FECHA DE CADUCIDAD:",null,null,"2023-07-01",null,null,null,null,null,{"$f":"TODAY()","v":"2025-02-07"}]
[]
[]
[]
[]
[]
[]
[]
[]
[]
[]
[]
[]
[]
[]
[]
[]
[]
[null,null,"DISPOSITIVOS",null,null,null,"AÑO",null,"VALOR LEGALES",null,"CIUDAD","Rep Legal","CI REP LEG","MES",null,null,"COLOR",null,"CÓDIGO COLOR","TASA","PRIMA NETA","SÚPER BANCOS","DERECHOS EMISIÓN","IVA","PRIMA TOTAL","MARCA SISE","CÓDIGO MARCA SISE","MARCA","CÓDIGO MARCA SISE","MODELO","CÓDIGO MODELO SISE","TIPO","GENERO","DIA","ESTADO CIVIL","% USO","AÑOS","GASTOS LEGALES",null,null,"PAÍS DE ORIGEN",null,"% ENTRADA","% RESTANTE","VALOR RESTANTE","CALCULO DÍAS",null,"BIN","FECHA PAGO","EXTRAER1","EXTRAER 2","ES VEHICULO FAMILIAR"]
[null,null,"TRACKLINK INTERACTIVO 12",46.573333333333345,469.28,null,2008,null,37.184000000000005,null,"QUITO","SILVIA JANNETH LEMA TAIPE",1715916951,"ENERO",null,null,"AMARILLO",null,1,{"$f":"(3.85/12)/100","v":3.2083333333333334E-3},{"$f":"ROUND(([6]FORM!$F$105*$T$172),2)","v":0},{"$f":"ROUND(($U$172*3.5%),2)","v":0},0.04,{"$f":"+[6]CERT!I18","v":4.7999999999999996E-3},{"$f":"+[6]CERT!I20","v":4.48E-2},"ALFA ROMEO",24,"ALFA ROMEO",24,146,1,"SEDAN","MASCULINO",1,"SOLTERO",5,1,"CORRIENTE",null,null,"ALEMANIA",null,{"$f":"+F103/F101","v":0},{"$f":"100%-AQ172","v":1},{"$f":"+F101-F103","v":10000},{"$f":"+F105/12","v":2},null,360041,16,{"$f":"MID(F151,1,6)","v":"360860"},{"$f":"MID(F151,7,8)","v":""},"SI"]
[null,null,"TRACKLINK INTERACTIVO 24",33.553333333333335,592.48,null,2009,null,17.920000000000002,null,"GUAYAQUIL","ERNEST FERDINAND VALLEJO COBOS","0926201138","FEBRERO",null,null,"AZUL",null,2,{"$f":"(3.25/12)/100","v":2.708333333333333E-3},{"$f":"ROUND(([6]FORM!$F$105*$T$173),2)","v":0},{"$f":"ROUND(($U$173*3.5%),2)","v":0},0.04,{"$f":"+[6]CERT!I18","v":4.7999999999999996E-3},{"$f":"+Y172","v":4.48E-2},"AUDI",1,"ALFA ROMEO",24,155,2,"SEDAN","FEMENINO",2,"CASADO",10,2,"3 MESES SIN INTERESES",null,null,"ARGENTINA",null,null,null,null,null,null,361329,16,null,null,"NO"]
[null,null,"TRACKLINK INTERACTIVO 36",29.213333333333335,715.68,null,2010,null,1.2,null,"CUENCA","ERNEST FERDINAND VALLEJO COBOS","0926201138","MARZO",null,null,"BEIGE",null,3,{"$f":"(2.5/12)/100","v":2.0833333333333333E-3},{"$f":"ROUND(([6]FORM!$F$105*$T$174),2)","v":0},{"$f":"ROUND(($U$174*3.5%),2)","v":0},0.04,{"$f":"+[6]CERT!I18","v":4.7999999999999996E-3},{"$f":"+Y173","v":4.48E-2},"AUSTIN",26,"ALFA ROMEO",24,156,3,"SEDAN",null,3,"VIUDO",15,3,null,null,null,"BRASIL",null,null,null,null,null,null,361349,1]
[null,null,"TRACKLINK INTERACTIVO 48",27.043333333333337,962.08,null,2011,null,1000,null,"AMBATO","SILVIA JANNETH LEMA TAIPE",1715916951,"ABRIL",null,null,"BLANCO",null,4,null,null,null,null,null,null,"BMW",2,"ALFA ROMEO",24,165,4,"SEDAN",null,4,"DIVORCIADO",20,4,null,null,null,"CANADÁ",null,null,null,null,null,null,362062,1]
[null,null,"TRACKLINK INTERACTIVO 60",25.741333333333337,1208.48,null,2012,null,1.1200000000000001,null,"IBARRA","SILVIA JANNETH LEMA TAIPE",1715916951,"MAYO",null,null,"CAFÉ",null,5,null,null,null,null,null,null,"BUICK",81,"ALFA ROMEO",24,166,5,"SEDAN",null,5,"UNIÓN LIBRE",25,null,null,null,null,"CHINA",null,null,null,null,null,null,362620,1]
[null,null,"TRACKLINK CONTROL 12",54.04,388.64,419,2013,null,44.8,null,"MANTA","ERNEST FERDINAND VALLEJO COBOS","0926201138","JUNIO",null,null,"CELESTE",null,6,null,null,null,null,null,null,"CHANGAN",83,"ALFA ROMEO",24,"SPIDER",6,"SEDAN",null,6,null,30,null,null,null,null,"CHILE",null,null,null,null,null,null,362621,1]
[null,null,"TRACKLINK CONTROL 24",39.620000000000005,511.84,null,2014,null,{"$f":"IF(F101>4000,F101-4000,44.8)","v":6000},null,"MACHALA","ERNEST FERDINAND VALLEJO COBOS","0926201138","JULIO",null,null,"CREMA",null,7,null,null,null,null,null,null,"CHEVROLET",3,"ALFA ROMEO",24,33,7,"SEDAN",null,7,null,35,null,null,null,null,"COLOMBIA",null,null,null,null,null,null,362622,16]
[null,null,"TRACKLINK CONTROL 36",34.81333333333334,635.04,null,2015,null,22.4,null,"LOJA","ERNEST FERDINAND VALLEJO COBOS","0926201138","AGOSTO",null,null,"FUCSIA",null,8,null,null,null,null,null,null,"CHRYSLER",4,"ALFA ROMEO",24,"GIO",8,"SEDAN",null,8,null,40,null,null,null,null,"ECUADOR",null,null,null,null,null,null,363999,16]
[null,null,"TRACKLINK CONTROL 48",32.410000000000004,881.44,null,2016,null,56,null,"PORTOVIEJO","ERNEST FERDINAND VALLEJO COBOS","0926201138","SEPTIEMBRE",null,null,"GRIS",null,9,null,null,null,null,null,null,"CITROEN",28,"ALFA ROMEO",24,164,9,"SEDAN",null,9,null,45,null,null,null,null,"ESPAÑA",null,null,null,null,null,null,364170,16]
[null,null,"TRACKLINK CONTROL 60",30.968000000000004,1127.8399999999999,{"$f":"+E176/48","v":25.176666666666666},null,null,null,null,"ALAMOR",null,null,"OCTUBRE",null,null,"LILA",null,10,null,null,null,null,null,null,"DACIA",29,"ALFA ROMEO",24,"GTV3",10,"SEDAN",null,10,null,50,null,null,null,null,"ESTADOS UNIDOS",null,null,null,null,null,null,364171,1]
[null,null,"TRACKLINK CONTROL PLUS 12",69.90666666666668,586.88,{"$f":"+(E177*1.05)","v":408.072},null,null,null,null,"ALAUSI",null,null,"NOVIEMBRE",null,null,"MORADO",null,11,null,null,null,null,null,null,"DAEWOO",5,"ALFA ROMEO",24,145,11,"COUPE",null,11,null,55,null,null,null,null,"NORUEGA",null,null,null,null,null,null,364172,16]
[null,null,"TRACKLINK CONTROL PLUS 24",47.506666666666668,736.96,null,null,null,null,null,"AMBUQUI",null,null,"DICIEMBRE",null,null,"NARANJA",null,12,null,null,null,null,null,null,"DAIHATSU",6,"ALFA ROMEO",24,147,12,"SEDAN",null,12,null,60,null,null,null,null,"HONG KONG",null,null,null,null,null,null,364173,1]
[null,null,"TRACKLINK CONTROL PLUS 36",40.04,887.04,null,null,null,null,null,"ANTONIO ANTE",null,null,null,null,null,"NEGRO",null,13,null,null,null,null,null,null,"DATSUN",30,"AUDI",1,80,1,"SEDAN",null,13,null,65,null,null,null,null,"FRANCIA",null,null,null,null,null,null,364190,16]
[null,null,"TRACKLINK CONTROL PLUS 48",36.306666666666672,1187.2,null,null,null,null,null,"ANTONIO ANTE",null,null,null,null,null,"PLATA",null,14,null,null,null,null,null,null,"DEER",111,"AUDI",1,"A3",2,"SEDAN",null,14,null,70,null,null,null,null,"INGLATERRA",null,null,null,null,null,null,364234,16]
[null,null,"TRACKLINK CONTROL PLUS 60",34.06666666666667,1487.36,{"$f":"+E181/48","v":23.496666666666666},null,null,null,null,"ARCHIDONA",null,null,null,null,null,"PLATEADO",null,15,null,null,null,null,null,null,"DODGE",31,"AUDI",1,"TT COUPE 1.8 QUATTRO",3,"SEDAN",null,15,null,75,null,null,null,null,"ITALIA",null,null,null,null,null,null,364261,16]
[null,null,"TRACKLINK CONTROL TOTAL 12",88.573333333333338,506.24,{"$f":"+(E182*1.05)","v":616.22400000000005},null,null,null,null,"ARENILLAS",null,null,null,null,null,"PLOMO",null,16,null,null,null,null,null,null,"FIAT",7,"AUDI",1,"A4",4,"SEDAN",null,16,null,80,null,null,null,null,"JAPÓN",null,null,null,null,null,null,364444,1]
[null,null,"TRACKLINK CONTROL TOTAL 24",60.153333333333336,656.32,null,null,null,null,null,"ATACAMES",null,null,null,null,null,"ROJO",null,17,null,null,null,null,null,null,"FORD",8,"AUDI",1,"A6",5,"SEDAN",null,17,null,85,null,null,null,null,"COREA",null,null,null,null,null,null,364522,16]
[null,null,"TRACKLINK CONTROL TOTAL 36",50.680000000000007,806.4,null,null,null,null,null,"ATUNTAQUI",null,null,null,null,null,"VERDE",null,18,null,null,null,null,null,null,"FSO",77,"AUDI",1,808,6,"SEDAN",null,18,null,90,null,null,null,null,"MÉXICO",null,null,null,null,null,null,364700,1]
[null,null,"TRACKLINK CONTROL TOTAL 48",45.943333333333335,1106.56,null,null,null,null,null,"AZOGUEZ",null,null,null,null,null,"VINO",null,19,null,null,null,null,null,null,"GMC",70,"AUDI",1,"A 62.8",7,"SEDAN",null,19,null,95,null,null,null,null,"PERU",null,null,null,null,null,null,364701,16]
[null,null,"TRACKLINK CONTROL TOTAL 60",43.101333333333336,1406.72,{"$f":"+E186/48","v":30.986666666666665},null,null,null,null,"BABAHOYO",null,null,null,null,null,"BRONCE",null,20,null,null,null,null,null,null,"GREAT WALL",108,"AUDI",1,"ALLROAD",8,"SEDAN",null,20,null,100,null,null,null,null,"REPUBLICA CHECA",null,null,null,null,null,null,364702,16]
[null,null,"SHERLOC 12",53.2,{"$f":"+D203*24","v":940.80000000000007},{"$f":"+(E187*1.05)","v":531.55200000000002},null,null,870,null,"BAHÍA DE CARÁQUEZ",null,null,null,null,null,"CHAMPAGNE",null,21,null,null,null,null,null,null,"HONDA",9,"AUDI",1,"A8",9,"SEDAN",null,21,null,null,null,null,null,null,"RUSIA",null,null,null,null,null,null,364703,1]
[null,null,"SHERLOC 24",40.549999999999997,{"$f":"+D204*24","v":860.16000000000008},null,null,null,null,null,"BALAO",null,null,null,null,null,"DORADO",null,22,null,null,null,null,null,null,"HUMMER",115,"AUSTIN",26,"MINI 1000",1,"COUPE",null,22,null,null,null,null,null,null,"SUECIA",null,null,null,null,null,null,364716,1]
[null,null,"SHERLOC 36",36.340000000000003,{"$f":"+D205*24","v":806.40000000000009},null,null,null,null,null,"BALSAS",null,null,null,null,null,"HABANO",null,23,null,null,null,null,null,null,"HYUNDAI",10,"AUSTIN",26,"MINI CORD",2,"COUPE",null,23,null,null,null,null,null,null,"VENEZUELA",null,null,null,null,null,null,364717,1]
[null,null,"SHERLOC 48",31.9,{"$f":"+D206*36","v":1169.28},null,null,null,null,null,"BALZAR",null,null,null,null,null,"MARRÓN",null,24,null,null,null,null,null,null,"INTERNATIONAL",44,"BMW",2,318,1,"SEDAN",null,24,null,null,null,null,null,null,"YUGOSLAVIA",null,null,null,null,null,null,364719,16]
[null,null,"SHERLOC 60",29.23,{"$f":"+D207*48","v":3064.32},{"$f":"+E191/48","v":29.306666666666668},null,null,null,null,"BAÑOS",null,null,null,null,null,"STRATO",null,25,null,null,null,null,null,null,"ISUZU",34,"BMW",2,"330I",2,"SEDAN",null,25,null,null,null,null,null,null,null,null,null,null,null,null,null,365001,16]
[null,null,"HUNTER LOJACK 12",41.887999999999998,null,null,null,null,null,null,"BIBLIAN",null,null,null,null,null,"VIOLETA",null,26,null,null,null,null,null,null,"JAGUAR",35,"BMW",2,"328I",3,"SEDAN",null,26,null,null,null,null,null,null,null,null,null,null,null,null,null,365147,16]
[null,null,"HUNTER LOJACK 24",33.6,null,null,null,null,null,null,"BOLÍVAR",null,null,null,null,null,"TURQUESA",null,27,null,null,null,null,null,null,"JEEP",71,"BMW",2,"325I",4,"SEDAN",null,27,null,null,null,null,null,null,null,null,null,null,null,null,null,365166,1]
[null,null,"HUNTER LOJACK 36",30.24,null,null,null,null,null,null,"BUENA FE",null,null,null,null,null,"ROSADO",null,28,null,null,null,null,null,null,"KIA",11,"BMW",2,"X5 4X4 5P",5,"JEEP",null,28,null,null,null,null,null,null,null,null,null,null,null,null,null,365167,1]
[null,null,"HUNTER LOJACK 48",29.12,null,null,null,null,null,null,"CALUMA",null,null,null,null,null,"ARENA",null,29,null,null,null,null,null,null,"LADA",13,"BMW",2,"528I",6,"SEDAN",null,29,null,null,null,null,null,null,null,null,null,null,null,null,null,365168,16]
[null,null,"HUNTER LOJACK 60",28,null,null,null,null,null,null,"CAÑAR",null,null,null,null,null,"ILUSIÓN",null,30,null,null,null,null,null,null,"LANCIA",36,"BMW",2,"316I",7,"SEDAN",null,30,null,null,null,null,null,null,null,null,null,null,null,null,null,365169,1]
[null,null,"H. MONITOREO BASICO 12",51.519999999999996,null,null,null,null,null,null,"CARIAMANGA",null,null,null,null,null,"ROBLE",null,31,null,null,null,null,null,null,"LAND ROVER",12,"BMW",2,"320I",8,"SEDAN",null,31,null,null,null,null,null,null,null,null,null,null,null,null,null,365181,1]
[null,null,"H. MONITOREO BASICO 24",39.200000000000003,null,null,null,null,null,null,"CATAMAYO",null,null,null,null,null,"MOSTAZA",null,32,null,null,null,null,null,null,"LEXUS",37,"BMW",2,"323I",9,"SEDAN",null,null,null,null,null,null,null,null,null,null,null,null,null,null,null,365420,1]
[null,null,"H. MONITOREO BASICO 36",35.840000000000003,null,null,null,null,null,null,"CAYAMBE",null,null,null,null,null,null,null,null,null,null,null,null,null,null,"LINCOLN",38,"BMW",2,"523I",10,"SEDAN",null,null,null,null,null,null,null,null,null,null,null,null,null,null,null,365421,16]
[null,null,"H. MONITOREO BASICO 48",33.6,null,null,null,null,null,null,"CELICA",null,null,null,null,null,null,null,null,null,null,null,null,null,null,"MAHINDRA",101,"BMW",2,"525I",11,"SEDAN",null,null,null,null,null,null,null,null,null,null,null,null,null,null,null,365422,1]
[null,null,"H. MONITOREO BASICO 60",32.479999999999997,null,null,null,null,null,null,"CHICA",null,null,null,null,null,null,null,null,null,null,null,null,null,null,"MAZDA",14,"BMW",2,"Z3",12,"COUPE",null,null,null,null,null,null,null,null,null,null,null,null,null,null,null,365423,16]
[null,null,"H. MONITOREO BÁSICO GOLDEN 12",63.84,null,null,null,null,null,null,"CHIMBO",null,null,null,null,null,null,null,null,null,null,null,null,null,null,"MERCEDES BENZ",15,"BMW",2,"Z8",13,"COUPE",null,null,null,null,null,null,null,null,null,null,null,null,null,null,null,365424,16]
[null,null,"H. MONITOREO BÁSICO GOLDEN 24",45.92]
[null,null,"H. MONITOREO BÁSICO GOLDEN 36",40.32,null,null,null,null,null,null,"CHONE",null,null,null,null,null,null,null,null,null,null,null,null,null,null,"MITSUBISHI",16,"BMW",2,"M3",14,"COUPE",null,null,null,null,null,null,null,null,null,null,null,null,null,null,null,365425,1]
[null,null,"H. MONITOREO BÁSICO GOLDEN 48",36.96,null,null,null,null,null,null,"COCA",null,null,null,null,null,null,null,null,null,null,null,null,null,null,"NISSAN",17,"BMW",2,"M5",15,"COUPE",null,null,null,null,null,null,null,null,null,null,null,null,null,null,null,365427,1]
[null,null,"H. MONITOREO BÁSICO GOLDEN 60",35.167999999999999,null,null,null,null,null,null,"CONCORDIA",null,null,null,null,null,null,null,null,null,null,null,null,null,null,"OLDSMOBIL",73,"BMW",2,520,16,"SEDAN",null,null,null,null,null,null,null,null,null,null,null,null,null,null,null,365428,1]
[null,null,"MARESA SATELITAL BY HUNTER 12",50.4,null,null,null,null,null,null,"COTACACHI",null,null,null,null,null,null,null,null,null,null,null,null,null,null,"OLTCIT",40,"BMW",2,"530IA",17,"SEDAN",null,null,null,null,null,null,null,null,null,null,null,null,null,null,null,365429,16]
[null,null,"MARESA SATELITAL BY HUNTER 24",40.32,null,null,null,null,null,null,"CUMBAYÁ",null,null,null,null,null,null,null,null,null,null,null,null,null,null,"PEUGEOT",18,"BMW",2,"318TI",18,"COUPE",null,null,null,null,null,null,null,null,null,null,null,null,null,null,null,365453,16]
[null,null,"MARESA SATELITAL BY HUNTER 36",36.96,null,null,null,null,null,null,"DAULE",null,null,null,null,null,null,null,null,null,null,null,null,null,null,"PLYMOUTH",54,"BMW",2,740,19,"SEDAN",null,null,null,null,null,null,null,null,null,null,null,null,null,null,null,365454,16]
[null,null,"MARESA SATELITAL BY HUNTER 48",35.840000000000003,null,null,null,null,null,null,"DURAN",null,null,null,null,null,null,null,null,null,null,null,null,null,null,"PORCHE",56,"BMW",2,1602,21,"SEDAN"]
[null,null,"MARESA SATELITAL BY HUNTER 60",34.72,null,null,null,null,null,null,"EL ÁNGEL",null,null,null,null,null,null,null,null,null,null,null,null,null,null,"RENAULT",19,"BMW",2,366,22,"SEDAN"]
[null,null,null,null,null,null,null,null,null,null,"EL CARMEN",null,null,null,null,null,null,null,null,null,null,null,null,null,null,"SAAB",45,"BMW",2,530,23,"SEDAN"]
[null,null,null,null,null,null,null,null,null,null,"EL CORAZÓN",null,null,null,null,null,null,null,null,null,null,null,null,null,null,"SAEHAN",57,"BMW",2,540,25,"SEDAN"]
[null,null,null,null,null,null,null,null,null,null,"EL EMPALME",null,null,null,null,null,null,null,null,null,null,null,null,null,null,"SAMSUNG",74,"BMW",2,"318IS",26,"SEDAN"]
[null,null,null,null,null,null,null,null,null,null,"EL GUABO",null,null,null,null,null,null,null,null,null,null,null,null,null,null,"SANGYONG",42,"BMW",2,"318I LIMUSIN",27,"SEDAN"]
[null,null,"Sin Dispositivo",null,null,null,null,null,null,null,"EL NARANJAL",null,null,null,null,null,null,null,null,null,null,null,null,null,null,"SEAT",105,"BMW",2,"Z4",29,"COUPE"]
[null,null,"TRACKLINK INTERACTIVO",null,null,null,null,null,null,null,"EL TAMBO",null,null,null,null,null,null,null,null,null,null,null,null,null,null,"SKODA",20,"BMW",2,"X3",31,"JEEP"]
[null,null,"TRACKLINK CONTROL",null,null,null,null,null,null,null,"EL TRIUNFO",null,null,null,null,null,null,null,null,null,null,null,null,null,null,"SUBARU",58,"BUICK",81,"CENTURY",1,"SEDAN"]
[null,null,"TRACKLINK CONTROL PLUS",null,null,null,null,null,null,null,"ESMERALDAS",null,null,null,null,null,null,null,null,null,null,null,null,null,null,"SUZUKI",60,"CHANGAN",83,"SC1011CG",1,"PICK-UP"]
[null,null,"TRACKLINK CONTROL TOTAL",null,null,null,null,null,null,null,"FLAVIO ALFARO",null,null,null,null,null,null,null,null,null,null,null,null,null,null,"TALBOT",59,"CHANGAN",83,"MINI VAN",2,"MINI VAN"]
[null,null,"SHERLOC",null,null,null,null,null,null,null,"GIRÓN",null,null,null,null,null,null,null,null,null,null,null,null,null,null,"TATA",75,"CHANGAN",83,"SC1018AA100",3,"PICK-UP"]
[null,null,"HUNTER LOJACK",null,null,null,null,null,null,null,"GONZALO PIZARRO",null,null,null,null,null,null,null,null,null,null,null,null,null,null,"TOYOTA",21,"CHEVROLET",3,"FORSA",1,"COUPE"]
[null,null,"H. MONITOREO BASICO",null,null,null,null,null,null,null,"GUALACEO",null,null,null,null,null,null,null,null,null,null,null,null,null,null,"VOLKSWAGEN",22,"CHEVROLET",3,"CORSA 3P",2,"COUPE"]
[null,null,"H. MONITOREO BÁSICO GOLDEN",null,null,null,null,null,null,null,"GUALAQUIZA",null,null,null,null,null,null,null,null,null,null,null,null,null,null,"VOLVO",23,"CHEVROLET",3,"CORSA 4P",3,"SEDAN"]
[null,null,"MARESA SATELITAL BY HUNTER",null,null,null,null,null,null,null,"GUAMOTE",null,null,null,null,null,null,null,null,null,null,null,null,null,null,"WORLDSTAR",99,"CHEVROLET",3,"CORSA 5P",4,"SEDAN"]
[null,null,null,null,null,null,null,null,null,null,"GUANO",null,null,null,null,null,null,null,null,null,null,null,null,null,null,"ZASTAVA",61,"CHEVROLET",3,"CORSA SPORT",5,"SEDAN"]
[null,null,null,null,null,null,null,null,null,null,"GUARANDA",null,null,null,null,null,null,null,null,null,null,null,null,null,null,null,null,"CHEVROLET",3,"CORSA P/U 1600",6,"PICK-UP"]
[null,null,null,null,null,null,null,null,null,null,"GUAYLLABAMBA",null,null,null,null,null,null,null,null,null,null,null,null,null,null,null,null,"CHEVROLET",3,"SAN REMO",7,"SEDAN"]
[null,null,null,null,null,null,null,null,null,null,"HUAQUILLAS",null,null,null,null,null,null,null,null,null,null,null,null,null,null,null,null,"CHEVROLET",3,"MONZA",8,"SEDAN"]
[null,null,null,null,null,null,null,null,null,null,"JIPIJAPA",null,null,null,null,null,null,null,null,null,null,null,null,null,null,null,null,"CHEVROLET",3,"SWIFT",9,"SEDAN"]
[null,null,null,null,null,null,null,null,null,null,"JUNIN",null,null,null,null,null,null,null,null,null,null,null,null,null,null,null,null,"CHEVROLET",3,"SWIFT EMOTION",10,"SEDAN"]
[null,null,null,null,null,null,null,null,null,null,"LA CONCORDIA",null,null,null,null,null,null,null,null,null,null,null,null,null,null,null,null,"CHEVROLET",3,"ESTEEM 4P",11,"SEDAN"]
[null,null,null,null,null,null,null,null,null,null,"LA MANA",null,null,null,null,null,null,null,null,null,null,null,null,null,null,null,null,"CHEVROLET",3,"ESTEEM S. WAGON",12,"STATION WAGON"]
[null,null,null,null,null,null,null,null,null,null,"LA UNIÓN",null,null,null,null,null,null,null,null,null,null,null,null,null,null,null,null,"CHEVROLET",3,"LUV 4X2 C/S",13,"PICK-UP"]
[null,null,null,null,null,null,null,null,null,null,"LAGO AGRIO",null,null,null,null,null,null,null,null,null,null,null,null,null,null,null,null,"CHEVROLET",3,"LUV 4X2 D/C",14,"PICK-UP"]
[null,null,null,null,null,null,null,null,null,null,"LAS LAJAS",null,null,null,null,null,null,null,null,null,null,null,null,null,null,null,null,"CHEVROLET",3,"LUV 4X4 C/S",15,"PICK-UP"]
[null,null,null,null,null,null,null,null,null,null,"LASSO",null,null,null,null,null,null,null,null,null,null,null,null,null,null,null,null,"CHEVROLET",3,"LUV 4X4 D/C",16,"PICK-UP"]
[null,null,null,null,null,null,null,null,null,null,"LATACUNGA",null,null,null,null,null,null,null,null,null,null,null,null,null,null,null,null,"CHEVROLET",3,"VITARA 3P",17,"JEEP"]
[null,null,null,null,null,null,null,null,null,null,"LIBERTAD",null,null,null,null,null,null,null,null,null,null,null,null,null,null,null,null,"CHEVROLET",3,"VITARA 5P",18,"JEEP"]
[null,null,null,null,null,null,null,null,null,null,"LIMÓN",null,null,null,null,null,null,null,null,null,null,null,null,null,null,null,null,"CHEVROLET",3,"RODEO 4X2",19,"JEEP"]
[null,null,null,null,null,null,null,null,null,null,"QUEVEDO",null,null,null,null,null,null,null,null,null,null,null,null,null,null,null,null,"CHEVROLET",3,"RODEO 4X4",20,"JEEP"]
[null,null,null,null,null,null,null,null,null,null,"LOS BANCOS",null,null,null,null,null,null,null,null,null,null,null,null,null,null,null,null,"CHEVROLET",3,"CAVALIER STD",21,"SEDAN"]
[null,null,null,null,null,null,null,null,null,null,"MACARA",null,null,null,null,null,null,null,null,null,null,null,null,null,null,null,null,"CHEVROLET",3,"CAVALIER DLX",22,"SEDAN"]
[null,null,null,null,null,null,null,null,null,null,"MACAS",null,null,null,null,null,null,null,null,null,null,null,null,null,null,null,null,"CHEVROLET",3,"SÚPER CARRY PICK UP",23,"PICK-UP"]
[null,null,null,null,null,null,null,null,null,null,"MACHACHI",null,null,null,null,null,null,null,null,null,null,null,null,null,null,null,null,"CHEVROLET",3,"GRAND BLAZER 3P",26,"JEEP"]
[null,null,null,null,null,null,null,null,null,null,"MÉNDEZ",null,null,null,null,null,null,null,null,null,null,null,null,null,null,null,null,"CHEVROLET",3,"GRAND BLAZER 5P",27,"JEEP"]
[null,null,null,null,null,null,null,null,null,null,"MILAGRO",null,null,null,null,null,null,null,null,null,null,null,null,null,null,null,null,"CHEVROLET",3,"TAHOE 5P. USA",28,"JEEP"]
[null,null,null,null,null,null,null,null,null,null,"MIRA",null,null,null,null,null,null,null,null,null,null,null,null,null,null,null,null,"CHEVROLET",3,"BLAZER 4X4",29,"JEEP"]
[null,null,null,null,null,null,null,null,null,null,"MOCACHE",null,null,null,null,null,null,null,null,null,null,null,null,null,null,null,null,"CHEVROLET",3,"BLAZER 4X2",30,"JEEP"]
[null,null,null,null,null,null,null,null,null,null,"MONTALVO",null,null,null,null,null,null,null,null,null,null,null,null,null,null,null,null,"CHEVROLET",3,"SILVERADO",31,"PICK-UP"]
[null,null,null,null,null,null,null,null,null,null,"MONTECRISTI",null,null,null,null,null,null,null,null,null,null,null,null,null,null,null,null,"CHEVROLET",3,"CHEYENNE",32,"PICK-UP"]
[null,null,null,null,null,null,null,null,null,null,"MONTUFAR",null,null,null,null,null,null,null,null,null,null,null,null,null,null,null,null,"CHEVROLET",3,"TROOPER 2.300 3P.",33,"JEEP"]
[null,null,null,null,null,null,null,null,null,null,"MUISNE",null,null,null,null,null,null,null,null,null,null,null,null,null,null,null,null,"CHEVROLET",3,"TROOPER 3P",34,"JEEP"]
[null,null,null,null,null,null,null,null,null,null,"NARANJITO",null,null,null,null,null,null,null,null,null,null,null,null,null,null,null,null,"CHEVROLET",3,"TROOPER 5P",35,"JEEP"]
[null,null,null,null,null,null,null,null,null,null,"NUEVA LOJA",null,null,null,null,null,null,null,null,null,null,null,null,null,null,null,null,"CHEVROLET",3,"GRAND VITARA 3P",36,"JEEP"]
[null,null,null,null,null,null,null,null,null,null,"OTAVALO",null,null,null,null,null,null,null,null,null,null,null,null,null,null,null,null,"CHEVROLET",3,"GRAND VITARA 5P",37,"JEEP"]
[null,null,null,null,null,null,null,null,null,null,"PAJAN",null,null,null,null,null,null,null,null,null,null,null,null,null,null,null,null,"CHEVROLET",3,"ALTO 5P",38,"SEDAN"]
[null,null,null,null,null,null,null,null,null,null,"PALENQUE",null,null,null,null,null,null,null,null,null,null,null,null,null,null,null,null,"CHEVROLET",3,"ASTRA 2P",39,"COUPE"]
[null,null,null,null,null,null,null,null,null,null,"PALESTINA",null,null,null,null,null,null,null,null,null,null,null,null,null,null,null,null,"CHEVROLET",3,"ASTRA 4P",40,"SEDAN"]
[null,null,null,null,null,null,null,null,null,null,"PALLATANGA",null,null,null,null,null,null,null,null,null,null,null,null,null,null,null,null,"CHEVROLET",3,"ASKA",41,"SEDAN"]
[null,null,null,null,null,null,null,null,null,null,"PASAJE",null,null,null,null,null,null,null,null,null,null,null,null,null,null,null,null,"CHEVROLET",3,"ASTROVAN",42,"MINI VAN"]
[null,null,null,null,null,null,null,null,null,null,"PASTAZA",null,null,null,null,null,null,null,null,null,null,null,null,null,null,null,null,"CHEVROLET",3,"CHEVETTE",44,"COUPE"]
[null,null,null,null,null,null,null,null,null,null,"PATATE",null,null,null,null,null,null,null,null,null,null,null,null,null,null,null,null,"CHEVROLET",3,"CONDOR",45,"COUPE"]
[null,null,null,null,null,null,null,null,null,null,"PAUTE",null,null,null,null,null,null,null,null,null,null,null,null,null,null,null,null,"CHEVROLET",3,"CORSICA",46,"SEDAN"]
[null,null,null,null,null,null,null,null,null,null,"PEDERNALES",null,null,null,null,null,null,null,null,null,null,null,null,null,null,null,null,"CHEVROLET",3,"GEMINI",47,"SEDAN"]
[null,null,null,null,null,null,null,null,null,null,"PEDRO CARBO",null,null,null,null,null,null,null,null,null,null,null,null,null,null,null,null,"CHEVROLET",3,"IMPALA",48,"SEDAN"]
[null,null,null,null,null,null,null,null,null,null,"PELILEO",null,null,null,null,null,null,null,null,null,null,null,null,null,null,null,null,"CHEVROLET",3,"VEGA",49,"SEDAN"]
[null,null,null,null,null,null,null,null,null,null,"PIFO",null,null,null,null,null,null,null,null,null,null,null,null,null,null,null,null,"CHEVROLET",3,"ZAFIRA 5P",51,"MINI VAN"]
[null,null,null,null,null,null,null,null,null,null,"PILLARO",null,null,null,null,null,null,null,null,null,null,null,null,null,null,null,null,"CHEVROLET",3,"CARGO",52,"PICK-UP"]
[null,null,null,null,null,null,null,null,null,null,"PIMAMPIRO",null,null,null,null,null,null,null,null,null,null,null,null,null,null,null,null,"CHEVROLET",3,"CHEVY VAN",53,"MINI VAN"]
[null,null,null,null,null,null,null,null,null,null,"PINDAL",null,null,null,null,null,null,null,null,null,null,null,null,null,null,null,null,"CHEVROLET",3,"MINI BLAZER 4X2",55,"JEEP"]
[null,null,null,null,null,null,null,null,null,null,"PIÑAS",null,null,null,null,null,null,null,null,null,null,null,null,null,null,null,null,"CHEVROLET",3,"MINI BLAZER 4X4",56,"JEEP"]
[null,null,null,null,null,null,null,null,null,null,"PLAYAS",null,null,null,null,null,null,null,null,null,null,null,null,null,null,null,null,"CHEVROLET",3,"CITATION",57,"SEDAN"]
[null,null,null,null,null,null,null,null,null,null,"PORTOVELO",null,null,null,null,null,null,null,null,null,null,null,null,null,null,null,null,"CHEVROLET",3,"C10",60,"PICK-UP"]
[null,null,null,null,null,null,null,null,null,null,"PUEBLO VIEJO",null,null,null,null,null,null,null,null,null,null,null,null,null,null,null,null,"CHEVROLET",3,"CREW CAB 4X4",65,"PICK-UP"]
[null,null,null,null,null,null,null,null,null,null,"PUEMBO",null,null,null,null,null,null,null,null,null,null,null,null,null,null,null,null,"CHEVROLET",3,"C1500",66,"PICK-UP"]
[null,null,null,null,null,null,null,null,null,null,"PUERTO CAYO",null,null,null,null,null,null,null,null,null,null,null,null,null,null,null,null,"CHEVROLET",3,"AVALANCHE",68,"PICK-UP"]
[null,null,null,null,null,null,null,null,null,null,"PUERTO LOPEZ",null,null,null,null,null,null,null,null,null,null,null,null,null,null,null,null,"CHEVROLET",3,"CORSA EVOLUTION",70,"SEDAN"]
[null,null,null,null,null,null,null,null,null,null,"PUERTO QUITO",null,null,null,null,null,null,null,null,null,null,null,null,null,null,null,null,"CHEVROLET",3,"TRAIL BLAZER 4X4",71,"JEEP"]
[null,null,null,null,null,null,null,null,null,null,"PUJILI",null,null,null,null,null,null,null,null,null,null,null,null,null,null,null,null,"CHEVROLET",3,"TRAIL BLAZER 4X2",72,"JEEP"]
[null,null,null,null,null,null,null,null,null,null,"PUYANGO",null,null,null,null,null,null,null,null,null,null,null,null,null,null,null,null,"CHEVROLET",3,"ASTRA 3P",73,"COUPE"]
[null,null,null,null,null,null,null,null,null,null,"PUYO",null,null,null,null,null,null,null,null,null,null,null,null,null,null,null,null,"CHEVROLET",3,"CORSA WIND",74,"SEDAN"]
[null,null,null,null,null,null,null,null,null,null,"QUERO",null,null,null,null,null,null,null,null,null,null,null,null,null,null,null,null,"CHEVROLET",3,"JIMNY 4X4",75,"JEEP"]
[null,null,null,null,null,null,null,null,null,null,"QUININDE",null,null,null,null,null,null,null,null,null,null,null,null,null,null,null,null,"CHEVROLET",3,"SPARK",76,"SEDAN"]
[null,null,null,null,null,null,null,null,null,null,"QUITO",null,null,null,null,null,null,null,null,null,null,null,null,null,null,null,null,"CHEVROLET",3,"CHEYENNE 4X2",77,"PICK-UP"]
[null,null,null,null,null,null,null,null,null,null,"RIOBAMBA",null,null,null,null,null,null,null,null,null,null,null,null,null,null,null,null,"CHEVROLET",3,"CHEYENNE 4X4",78,"PICK-UP"]
[null,null,null,null,null,null,null,null,null,null,"ROCAFUERTE",null,null,null,null,null,null,null,null,null,null,null,null,null,null,null,null,"CHEVROLET",3,"OPTRA",79,"SEDAN"]
[null,null,null,null,null,null,null,null,null,null,"SALCEDO",null,null,null,null,null,null,null,null,null,null,null,null,null,null,null,null,"CHEVROLET",3,"GRAND VITARA 5P XL7 4X4",80,"JEEP"]
[null,null,null,null,null,null,null,null,null,null,"SALINAS",null,null,null,null,null,null,null,null,null,null,null,null,null,null,null,null,"CHEVROLET",3,"GRAND VITARA 5P XL7 4X2",81,"JEEP"]
[null,null,null,null,null,null,null,null,null,null,"SAMBORONDON",null,null,null,null,null,null,null,null,null,null,null,null,null,null,null,null,"CHEVROLET",3,"LUV D-MAX C/S 4X2",82,"PICK-UP"]
[null,null,null,null,null,null,null,null,null,null,"SAME",null,null,null,null,null,null,null,null,null,null,null,null,null,null,null,null,"CHEVROLET",3,"LUV D-MAX C/D 4X2",83,"PICK-UP"]
[null,null,null,null,null,null,null,null,null,null,"SAN CAMILO",null,null,null,null,null,null,null,null,null,null,null,null,null,null,null,null,"CHEVROLET",3,"LUV D-MAX C/S 4X4",84,"PICK-UP"]
[null,null,null,null,null,null,null,null,null,null,"SAN GABRIEL",null,null,null,null,null,null,null,null,null,null,null,null,null,null,null,null,"CHEVROLET",3,"LUV D-MAX C/D 4X4",85,"PICK-UP"]
[null,null,null,null,null,null,null,null,null,null,"SAN LORENZO",null,null,null,null,null,null,null,null,null,null,null,null,null,null,null,null,"CHRYSLER",4,"GRAND CHEROKEE LAREDO 4X4",1,"JEEP"]
[null,null,null,null,null,null,null,null,null,null,"SAN MIGUEL",null,null,null,null,null,null,null,null,null,null,null,null,null,null,null,null,"CHRYSLER",4,"GRAND CHEROKEE LIMITED 4X4",2,"JEEP"]
[null,null,null,null,null,null,null,null,null,null,"SAN RAFAEL",null,null,null,null,null,null,null,null,null,null,null,null,null,null,null,null,"CHRYSLER",4,"CHEROKEE LAREDO",3,"JEEP"]
[null,null,null,null,null,null,null,null,null,null,"SAN VICENTE",null,null,null,null,null,null,null,null,null,null,null,null,null,null,null,null,"CHRYSLER",4,"NEON 2000CC",4,"SEDAN"]
[null,null,null,null,null,null,null,null,null,null,"SANGOLQUI",null,null,null,null,null,null,null,null,null,null,null,null,null,null,null,null,"CHRYSLER",4,"CARAVAN",5,"MINI VAN"]
[null,null,null,null,null,null,null,null,null,null,"SANTA ANA",null,null,null,null,null,null,null,null,null,null,null,null,null,null,null,null,"CHRYSLER",4,"GRAND CARAVAN",6,"MINI VAN"]
[null,null,null,null,null,null,null,null,null,null,"SANTA CRUZ",null,null,null,null,null,null,null,null,null,null,null,null,null,null,null,null,"CHRYSLER",4,"LEBARON",7,"SEDAN"]
[null,null,null,null,null,null,null,null,null,null,"SANTA ELENA",null,null,null,null,null,null,null,null,null,null,null,null,null,null,null,null,"CHRYSLER",4,"LIBERTY",8,"JEEP"]
[null,null,null,null,null,null,null,null,null,null,"SANTA ISABEL",null,null,null,null,null,null,null,null,null,null,null,null,null,null,null,null,"CHRYSLER",4,"STRATUS",9,"SEDAN"]
[null,null,null,null,null,null,null,null,null,null,"SANTA ISABEL",null,null,null,null,null,null,null,null,null,null,null,null,null,null,null,null,"CHRYSLER",4,"RENEGADO",10,"JEEP"]
[null,null,null,null,null,null,null,null,null,null,"SANTA ROSA",null,null,null,null,null,null,null,null,null,null,null,null,null,null,null,null,"CHRYSLER",4,"TOWN & COUNTRY",11,"PICK-UP"]
[null,null,null,null,null,null,null,null,null,null,"SANTO DOMINGO",null,null,null,null,null,null,null,null,null,null,null,null,null,null,null,null,"CITROEN",28,"AX GT",1,"SEDAN"]
[null,null,null,null,null,null,null,null,null,null,"SAQUISILI",null,null,null,null,null,null,null,null,null,null,null,null,null,null,null,null,"CITROEN",28,"BERLINGO",2,"SEDAN"]
[null,null,null,null,null,null,null,null,null,null,"SARAGURO",null,null,null,null,null,null,null,null,null,null,null,null,null,null,null,null,"CITROEN",28,"SAXO SX",3,"SEDAN"]
[null,null,null,null,null,null,null,null,null,null,"SHUSHUFINDI",null,null,null,null,null,null,null,null,null,null,null,null,null,null,null,null,"CITROEN",28,"XANTIA",4,"SEDAN"]
[null,null,null,null,null,null,null,null,null,null,"SIGCHOS",null,null,null,null,null,null,null,null,null,null,null,null,null,null,null,null,"CITROEN",28,"XSARA VTS",5,"SEDAN"]
[null,null,null,null,null,null,null,null,null,null,"SIGSIG",null,null,null,null,null,null,null,null,null,null,null,null,null,null,null,null,"CITROEN",28,"ZX VOLCANE",6,"SEDAN"]
[null,null,null,null,null,null,null,null,null,null,"SUCRE",null,null,null,null,null,null,null,null,null,null,null,null,null,null,null,null,"CITROEN",28,"ALLUER 5P",7,"STATION WAGON"]
[null,null,null,null,null,null,null,null,null,null,"SUCUA",null,null,null,null,null,null,null,null,null,null,null,null,null,null,null,null,"CITROEN",28,"XSARA PICASSO",8,"SEDAN"]
[null,null,null,null,null,null,null,null,null,null,"SUCUMBIOS",null,null,null,null,null,null,null,null,null,null,null,null,null,null,null,null,"CITROEN",28,"C3 SX 14I",9,"SEDAN"]
[null,null,null,null,null,null,null,null,null,null,"TABABELA",null,null,null,null,null,null,null,null,null,null,null,null,null,null,null,null,"DACIA",29,"1304 DROP-SIDE",1,"PICK-UP"]
[null,null,null,null,null,null,null,null,null,null,"TABACUNDO",null,null,null,null,null,null,null,null,null,null,null,null,null,null,null,null,"DACIA",29,"BREAK",2,"SEDAN"]
[null,null,null,null,null,null,null,null,null,null,"TAMBILLO",null,null,null,null,null,null,null,null,null,null,null,null,null,null,null,null,"DACIA",29,"RAPSODIE",3,"SEDAN"]
[null,null,null,null,null,null,null,null,null,null,"TENA",null,null,null,null,null,null,null,null,null,null,null,null,null,null,null,null,"DAEWOO",5,"TICO 5P. SX",1,"SEDAN"]
[null,null,null,null,null,null,null,null,null,null,"TONSUPA",null,null,null,null,null,null,null,null,null,null,null,null,null,null,null,null,"DAEWOO",5,"MATIZ",2,"SEDAN"]
[null,null,null,null,null,null,null,null,null,null,"TOSAGUA",null,null,null,null,null,null,null,null,null,null,null,null,null,null,null,null,"DAEWOO",5,"LANOS 4P",3,"SEDAN"]
[null,null,null,null,null,null,null,null,null,null,"TULCAN",null,null,null,null,null,null,null,null,null,null,null,null,null,null,null,null,"DAEWOO",5,"LANOS 5P",4,"SEDAN"]
[null,null,null,null,null,null,null,null,null,null,"TUMBACO",null,null,null,null,null,null,null,null,null,null,null,null,null,null,null,null,"DAEWOO",5,"LANOS 3P",5,"SEDAN"]
[null,null,null,null,null,null,null,null,null,null,"URCUQUI",null,null,null,null,null,null,null,null,null,null,null,null,null,null,null,null,"DAEWOO",5,"NUBIRA",6,"SEDAN"]
[null,null,null,null,null,null,null,null,null,null,"URDANETA",null,null,null,null,null,null,null,null,null,null,null,null,null,null,null,null,"DAEWOO",5,"TACUMA",7,"MINI VAN"]
[null,null,null,null,null,null,null,null,null,null,"VENTANAS",null,null,null,null,null,null,null,null,null,null,null,null,null,null,null,null,"DAEWOO",5,"ESPERO",8,"SEDAN"]
[null,null,null,null,null,null,null,null,null,null,"VINCES",null,null,null,null,null,null,null,null,null,null,null,null,null,null,null,null,"DAEWOO",5,"RACER",9,"SEDAN"]
[null,null,null,null,null,null,null,null,null,null,"YAGUACHI",null,null,null,null,null,null,null,null,null,null,null,null,null,null,null,null,"DAEWOO",5,"CIELO",10,"SEDAN"]
[null,null,null,null,null,null,null,null,null,null,"ZAMORA",null,null,null,null,null,null,null,null,null,null,null,null,null,null,null,null,"DAEWOO",5,"COACH",11,"SEDAN"]
[null,null,null,null,null,null,null,null,null,null,"ZAPOTILLO",null,null,null,null,null,null,null,null,null,null,null,null,null,null,null,null,"DAEWOO",5,"DAMAS",12,"SEDAN"]
[null,null,null,null,null,null,null,null,null,null,"ZARUMA",null,null,null,null,null,null,null,null,null,null,null,null,null,null,null,null,"DAEWOO",5,"KORANDO",13,"JEEP"]
[null,null,null,null,null,null,null,null,null,null,null,null,null,null,null,null,null,null,null,null,null,null,null,null,null,null,null,"DAEWOO",5,"MUSSO",14,"JEEP"]
[null,null,null,null,null,null,null,null,null,null,null,null,null,null,null,null,null,null,null,null,null,null,null,null,null,null,null,"DAEWOO",5,"LEGANZA",15,"SEDAN"]
[null,null,null,null,null,null,null,null,null,null,null,null,null,null,null,null,null,null,null,null,null,null,null,null,null,null,null,"DAIHATSU",6,"TERIOS",1,"JEEP"]
[null,null,"Valor del vehículo",{"$f":"$F$101","v":10000},null,null,null,null,null,null,null,null,null,null,null,null,null,null,null,null,null,null,null,null,null,null,null,"DAIHATSU",6,"APLAUSSE",2,"SEDAN"]
[null,null,"INSCRIPCIÓN EN REGISTRO MERCANTIL",null,null,null,null,null,null,null,null,null,null,null,null,null,null,null,null,null,null,null,null,null,null,null,null,"DAIHATSU",6,"CHARADE",3,"SEDAN"]
[null,null,"VALOR BASE POR CONTRATO",25,null,null,null,null,null,null,null,null,null,null,null,null,null,null,null,null,null,null,null,null,null,null,null,"DAIHATSU",6,"FEROZA",5,"JEEP"]
[null,null,"CESIÓN DE DERECHOS",25,null,null,null,null,null,null,null,null,null,null,null,null,null,null,null,null,null,null,null,null,null,null,null,"DAIHATSU",6,"GRAND MOVE",6,"SEDAN"]
[null,null,"0.5% SOBRE LA CUANTÍA DEL CONTRATO (PRECIO DE VENTA).",{"$f":"D338*0.5%","v":50},null,null,null,null,null,null,null,null,null,null,null,null,null,null,null,null,null,null,null,null,null,null,null,"DAIHATSU",6,"ROCKY",7,"JEEP"]
[null,null,"TOTAL",{"$f":"SUM(D340:D342)","v":100},null,null,null,null,null,null,null,null,null,null,null,null,null,null,null,null,null,null,null,null,null,null,null,"DAIHATSU",6,"A45 L",8,"SEDAN"]
[null,null,"OTROS GASTOS",null,null,null,null,null,null,null,null,null,null,null,null,null,null,null,null,null,null,null,null,null,null,null,null,"DAIHATSU",6,"COURE",9,"SEDAN"]
[null,null,"TRAMITACIÓN LEGAL, SERVICIO DE TERCERO",40,null,null,null,null,null,null,null,null,null,null,null,null,null,null,null,null,null,null,null,null,null,null,null,"DATSUN",30,1200,1,"PICK-UP"]
[null,null,null,null,null,null,null,null,null,null,null,null,null,null,null,null,null,null,null,null,null,null,null,null,null,null,null,"DATSUN",30,1500,2,"PICK-UP"]
[null,null,"Tarifa gastos legales",{"$f":"+D343+D345","v":140},null,null,null,null,null,null,null,null,null,null,null,null,null,null,null,null,null,null,null,null,null,null,null,"DATSUN",30,1800,3,"PICK-UP"]
[null,null,null,null,null,null,null,null,null,null,null,null,null,null,null,null,null,null,null,null,null,null,null,null,null,null,null,"DATSUN",30,"120Y",4,"SEDAN"]
[null,null,null,null,null,null,null,null,null,null,null,null,null,null,null,null,null,null,null,null,null,null,null,null,null,null,null,"DATSUN",30,"160J",5,"SEDAN"]
[null,null,null,null,null,null,null,null,null,null,null,null,null,null,null,null,null,null,null,null,null,null,null,null,null,null,null,"DATSUN",30,"B 210",6,"COUPE"]
[null,null,null,null,null,null,null,null,null,null,null,null,null,null,null,null,null,null,null,null,null,null,null,null,null,null,null,"DATSUN",30,1000,7,"PICK-UP"]
[null,null,null,null,null,null,null,null,null,null,null,null,null,null,null,null,null,null,null,null,null,null,null,null,null,null,null,"DEER",111,"CC 1020 D",1,"PICK-UP"]
[null,null,null,null,null,null,null,null,null,null,null,null,null,null,null,null,null,null,null,null,null,null,null,null,null,null,null,"DODGE",31,"RAM 4X4",1,"PICK-UP"]
[null,null,null,null,null,null,null,null,null,null,null,null,null,null,null,null,null,null,null,null,null,null,null,null,null,null,null,"DODGE",31,"RAM 4X2",2,"PICK-UP"]
[null,null,null,null,null,null,null,null,null,null,null,null,null,null,null,null,null,null,null,null,null,null,null,null,null,null,null,"DODGE",31,"DAKOTA",3,"PICK-UP"]
[null,null,null,null,null,null,null,null,null,null,null,null,null,null,null,null,null,null,null,null,null,null,null,null,null,null,null,"DODGE",31,"DURANGO",4,"JEEP"]
[null,null,null,null,null,null,null,null,null,null,null,null,null,null,null,null,null,null,null,null,null,null,null,null,null,null,null,"DODGE",31,"ASPEN",5,"SEDAN"]
[null,null,null,null,null,null,null,null,null,null,null,null,null,null,null,null,null,null,null,null,null,null,null,null,null,null,null,"DODGE",31,"CARAVAN",7,"MINI VAN"]
[null,null,null,null,null,null,null,null,null,null,null,null,null,null,null,null,null,null,null,null,null,null,null,null,null,null,null,"FIAT",7,"UNO MILLE",1,"SEDAN"]
[null,null,null,null,null,null,null,null,null,null,null,null,null,null,null,null,null,null,null,null,null,null,null,null,null,null,null,"FIAT",7,"UNO",2,"COUPE"]
[null,null,null,null,null,null,null,null,null,null,null,null,null,null,null,null,null,null,null,null,null,null,null,null,null,null,null,"FIAT",7,"PREMIO",3,"SEDAN"]
[null,null,null,null,null,null,null,null,null,null,null,null,null,null,null,null,null,null,null,null,null,null,null,null,null,null,null,"FIAT",7,"FIORINO",4,"PICK-UP"]
[null,null,null,null,null,null,null,null,null,null,null,null,null,null,null,null,null,null,null,null,null,null,null,null,null,null,null,"FIAT",7,"PALIO",5,"SEDAN"]
[null,null,null,null,null,null,null,null,null,null,null,null,null,null,null,null,null,null,null,null,null,null,null,null,null,null,null,"FIAT",7,"POLSKY",6,"SEDAN"]
[null,null,null,null,null,null,null,null,null,null,null,null,null,null,null,null,null,null,null,null,null,null,null,null,null,null,null,"FIAT",7,"SPAZIO",7,"SEDAN"]
[null,null,null,null,null,null,null,null,null,null,null,null,null,null,null,null,null,null,null,null,null,null,null,null,null,null,null,"FIAT",7,"WEEKWEND",8,"SEDAN"]
[null,null,null,null,null,null,null,null,null,null,null,null,null,null,null,null,null,null,null,null,null,null,null,null,null,null,null,"FIAT",7,"CROMA",9,"SEDAN"]
[null,null,null,null,null,null,null,null,null,null,null,null,null,null,null,null,null,null,null,null,null,null,null,null,null,null,null,"FIAT",7,124,10,"COUPE"]
[null,null,null,null,null,null,null,null,null,null,null,null,null,null,null,null,null,null,null,null,null,null,null,null,null,null,null,"FIAT",7,132,11,"SEDAN"]
[null,null,null,null,null,null,null,null,null,null,null,null,null,null,null,null,null,null,null,null,null,null,null,null,null,null,null,"FIAT",7,"TIPO SX",13,"SEDAN"]
[null,null,null,null,null,null,null,null,null,null,null,null,null,null,null,null,null,null,null,null,null,null,null,null,null,null,null,"FIAT",7,"FLARESIDE",14,"SEDAN"]
[null,null,null,null,null,null,null,null,null,null,null,null,null,null,null,null,null,null,null,null,null,null,null,null,null,null,null,"FIAT",7,"SIENA",15,"SEDAN"]
[null,null,null,null,null,null,null,null,null,null,null,null,null,null,null,null,null,null,null,null,null,null,null,null,null,null,null,"FIAT",7,"STRADA",16,"PICK-UP"]
[null,null,null,null,null,null,null,null,null,null,null,null,null,null,null,null,null,null,null,null,null,null,null,null,null,null,null,"FIAT",7,"STILO CONFORT",17,"SEDAN"]
[null,null,null,null,null,null,null,null,null,null,null,null,null,null,null,null,null,null,null,null,null,null,null,null,null,null,null,"FIAT",7,"STILO",18,"SEDAN"]
[null,null,null,null,null,null,null,null,null,null,null,null,null,null,null,null,null,null,null,null,null,null,null,null,null,null,null,"FORD",8,"FESTIVA",1,"SEDAN"]
[null,null,null,null,null,null,null,null,null,null,null,null,null,null,null,null,null,null,null,null,null,null,null,null,null,null,null,"FORD",8,"ESCORT",2,"SEDAN"]
[null,null,null,null,null,null,null,null,null,null,null,null,null,null,null,null,null,null,null,null,null,null,null,null,null,null,null,"FORD",8,"COURIER",3,"PICK-UP"]
[null,null,null,null,null,null,null,null,null,null,null,null,null,null,null,null,null,null,null,null,null,null,null,null,null,null,null,"FORD",8,"RANGER 4X2",4,"PICK-UP"]
[null,null,null,null,null,null,null,null,null,null,null,null,null,null,null,null,null,null,null,null,null,null,null,null,null,null,null,"FORD",8,"RANGER 4X4",5,"PICK-UP"]
[null,null,null,null,null,null,null,null,null,null,null,null,null,null,null,null,null,null,null,null,null,null,null,null,null,null,null,"FORD",8,"RANGER CREW CAB 4X4",6,"PICK-UP"]
[null,null,null,null,null,null,null,null,null,null,null,null,null,null,null,null,null,null,null,null,null,null,null,null,null,null,null,"FORD",8,"F-150 XL 4X2",7,"PICK-UP"]
[null,null,null,null,null,null,null,null,null,null,null,null,null,null,null,null,null,null,null,null,null,null,null,null,null,null,null,"FORD",8,"F-150 XL 4X4",8,"PICK-UP"]
[null,null,null,null,null,null,null,null,null,null,null,null,null,null,null,null,null,null,null,null,null,null,null,null,null,null,null,"FORD",8,"F-150 LARIAT",9,"PICK-UP"]
[null,null,null,null,null,null,null,null,null,null,null,null,null,null,null,null,null,null,null,null,null,null,null,null,null,null,null,"FORD",8,"BRONCO",10,"JEEP"]
[null,null,null,null,null,null,null,null,null,null,null,null,null,null,null,null,null,null,null,null,null,null,null,null,null,null,null,"FORD",8,"EXPLORER 4X2 XL 3P",11,"JEEP"]
[null,null,null,null,null,null,null,null,null,null,null,null,null,null,null,null,null,null,null,null,null,null,null,null,null,null,null,"FORD",8,"EXPLORER 4X4 3P",12,"JEEP"]
[null,null,null,null,null,null,null,null,null,null,null,null,null,null,null,null,null,null,null,null,null,null,null,null,null,null,null,"FORD",8,"EXPLORER 4X4 5P",13,"JEEP"]
[null,null,null,null,null,null,null,null,null,null,null,null,null,null,null,null,null,null,null,null,null,null,null,null,null,null,null,"FORD",8,"EXPLORER 4X2 5P",14,"JEEP"]
[null,null,null,null,null,null,null,null,null,null,null,null,null,null,null,null,null,null,null,null,null,null,null,null,null,null,null,"FORD",8,"EXPEDITION EDDIE BAUER",15,"JEEP"]
[null,null,null,null,null,null,null,null,null,null,null,null,null,null,null,null,null,null,null,null,null,null,null,null,null,null,null,"FORD",8,"ESCAPE",16,"JEEP"]
[null,null,null,null,null,null,null,null,null,null,null,null,null,null,null,null,null,null,null,null,null,null,null,null,null,null,null,"FORD",8,"AEROSTAR",17,"MINI VAN"]
[null,null,null,null,null,null,null,null,null,null,null,null,null,null,null,null,null,null,null,null,null,null,null,null,null,null,null,"FORD",8,"CLUB WAGON",18,"MINI VAN"]
[null,null,null,null,null,null,null,null,null,null,null,null,null,null,null,null,null,null,null,null,null,null,null,null,null,null,null,"FORD",8,"CONTOUR",19,"SEDAN"]
[null,null,null,null,null,null,null,null,null,null,null,null,null,null,null,null,null,null,null,null,null,null,null,null,null,null,null,"FORD",8,"ECONOLINE",20,"MINI VAN"]
[null,null,null,null,null,null,null,null,null,null,null,null,null,null,null,null,null,null,null,null,null,null,null,null,null,null,null,"FORD",8,"F-250",21,"PICK-UP"]
[null,null,null,null,null,null,null,null,null,null,null,null,null,null,null,null,null,null,null,null,null,null,null,null,null,null,null,"FORD",8,"F-350",22,"PICK-UP"]
[null,null,null,null,null,null,null,null,null,null,null,null,null,null,null,null,null,null,null,null,null,null,null,null,null,null,null,"FORD",8,"F-470",23,"PICK-UP"]
[null,null,null,null,null,null,null,null,null,null,null,null,null,null,null,null,null,null,null,null,null,null,null,null,null,null,null,"FORD",8,"F-600",24,"PICK-UP"]
[null,null,null,null,null,null,null,null,null,null,null,null,null,null,null,null,null,null,null,null,null,null,null,null,null,null,null,"FORD",8,"F-700",25,"PICK-UP"]
[null,null,null,null,null,null,null,null,null,null,null,null,null,null,null,null,null,null,null,null,null,null,null,null,null,null,null,"FORD",8,"FIESTA",26,"COUPE"]
[null,null,null,null,null,null,null,null,null,null,null,null,null,null,null,null,null,null,null,null,null,null,null,null,null,null,null,"FORD",8,"MAVERICK",27,"SEDAN"]
[null,null,null,null,null,null,null,null,null,null,null,null,null,null,null,null,null,null,null,null,null,null,null,null,null,null,null,"FORD",8,"MONDEO",28,"SEDAN"]
[null,null,null,null,null,null,null,null,null,null,null,null,null,null,null,null,null,null,null,null,null,null,null,null,null,null,null,"FORD",8,"TAURUS",29,"SEDAN"]
[null,null,null,null,null,null,null,null,null,null,null,null,null,null,null,null,null,null,null,null,null,null,null,null,null,null,null,"FORD",8,"SIERRA",30,"PICK-UP"]
[null,null,null,null,null,null,null,null,null,null,null,null,null,null,null,null,null,null,null,null,null,null,null,null,null,null,null,"FORD",8,"SUPER DUTY",31,"MINI VAN"]
[null,null,null,null,null,null,null,null,null,null,null,null,null,null,null,null,null,null,null,null,null,null,null,null,null,null,null,"FORD",8,"TEMPO",32,"SEDAN"]
[null,null,null,null,null,null,null,null,null,null,null,null,null,null,null,null,null,null,null,null,null,null,null,null,null,null,null,"FORD",8,"WINDSTAR",33,"MINI VAN"]
[null,null,null,null,null,null,null,null,null,null,null,null,null,null,null,null,null,null,null,null,null,null,null,null,null,null,null,"FORD",8,"FUERTE",34,"JEEP"]
[null,null,null,null,null,null,null,null,null,null,null,null,null,null,null,null,null,null,null,null,null,null,null,null,null,null,null,"FORD",8,"F-100",35,"PICK-UP"]
[null,null,null,null,null,null,null,null,null,null,null,null,null,null,null,null,null,null,null,null,null,null,null,null,null,null,null,"FORD",8,"LASER",36,"SEDAN"]
[null,null,null,null,null,null,null,null,null,null,null,null,null,null,null,null,null,null,null,null,null,null,null,null,null,null,null,"FORD",8,"MUSTANG",38,"COUPE"]
[null,null,null,null,null,null,null,null,null,null,null,null,null,null,null,null,null,null,null,null,null,null,null,null,null,null,null,"FORD",8,"RANGER 4X2 D/C",40,"PICK-UP"]
[null,null,null,null,null,null,null,null,null,null,null,null,null,null,null,null,null,null,null,null,null,null,null,null,null,null,null,"FORD",8,"RANGER 4X4 D/C",41,"PICK-UP"]
[null,null,null,null,null,null,null,null,null,null,null,null,null,null,null,null,null,null,null,null,null,null,null,null,null,null,null,"FORD",8,"CUSTOM",42,"PICK-UP"]
[null,null,null,null,null,null,null,null,null,null,null,null,null,null,null,null,null,null,null,null,null,null,null,null,null,null,null,"FORD",8,"F-500",45,"PICK-UP"]
[null,null,null,null,null,null,null,null,null,null,null,null,null,null,null,null,null,null,null,null,null,null,null,null,null,null,null,"FORD",8,"F-650",46,"PICK-UP"]
[null,null,null,null,null,null,null,null,null,null,null,null,null,null,null,null,null,null,null,null,null,null,null,null,null,null,null,"FORD",8,"F-750",47,"PICK-UP"]
[null,null,null,null,null,null,null,null,null,null,null,null,null,null,null,null,null,null,null,null,null,null,null,null,null,null,null,"FORD",8,"FIESTA 4P",48,"SEDAN"]
[null,null,null,null,null,null,null,null,null,null,null,null,null,null,null,null,null,null,null,null,null,null,null,null,null,null,null,"FORD",8,"LTD",49,"SEDAN"]
[null,null,null,null,null,null,null,null,null,null,null,null,null,null,null,null,null,null,null,null,null,null,null,null,null,null,null,"FORD",8,"EXCURSION 4X4",50,"JEEP"]
[null,null,null,null,null,null,null,null,null,null,null,null,null,null,null,null,null,null,null,null,null,null,null,null,null,null,null,"FORD",8,"ECOSPORT 4X2",51,"JEEP"]
[null,null,null,null,null,null,null,null,null,null,null,null,null,null,null,null,null,null,null,null,null,null,null,null,null,null,null,"FORD",8,"ECOSPORT 4X4",52,"JEEP"]
[null,null,null,null,null,null,null,null,null,null,null,null,null,null,null,null,null,null,null,null,null,null,null,null,null,null,null,"FORD",8,"FOCUS",53,"SEDAN"]
[null,null,null,null,null,null,null,null,null,null,null,null,null,null,null,null,null,null,null,null,null,null,null,null,null,null,null,"FORD",8,"EXPLORER SPORT TRACK",54,"JEEP"]
[null,null,null,null,null,null,null,null,null,null,null,null,null,null,null,null,null,null,null,null,null,null,null,null,null,null,null,"FORD",8,"GRANADA",55,"SEDAN"]
[null,null,null,null,null,null,null,null,null,null,null,null,null,null,null,null,null,null,null,null,null,null,null,null,null,null,null,"FORD",8,"EXPLORER SPORT TRACK 4X2",56,"JEEP"]
[null,null,null,null,null,null,null,null,null,null,null,null,null,null,null,null,null,null,null,null,null,null,null,null,null,null,null,"FSO",77,"GLE 1600CC",1,"SEDAN"]
[null,null,null,null,null,null,null,null,null,null,null,null,null,null,null,null,null,null,null,null,null,null,null,null,null,null,null,"GMC",70,"SIERRA",1,"JEEP"]
[null,null,null,null,null,null,null,null,null,null,null,null,null,null,null,null,null,null,null,null,null,null,null,null,null,null,null,"GMC",70,"BLAZER",2,"JEEP"]
[null,null,null,null,null,null,null,null,null,null,null,null,null,null,null,null,null,null,null,null,null,null,null,null,null,null,null,"GMC",70,"SAFARY",3,"PICK-UP"]
[null,null,null,null,null,null,null,null,null,null,null,null,null,null,null,null,null,null,null,null,null,null,null,null,null,null,null,"GREAT WALL",108,"CC1020C C/S",1,"PICK-UP"]
[null,null,null,null,null,null,null,null,null,null,null,null,null,null,null,null,null,null,null,null,null,null,null,null,null,null,null,"GREAT WALL",108,"CC1020D",2,"PICK-UP"]
[null,null,null,null,null,null,null,null,null,null,null,null,null,null,null,null,null,null,null,null,null,null,null,null,null,null,null,"HONDA",9,"CRV 4X4",1,"JEEP"]
[null,null,null,null,null,null,null,null,null,null,null,null,null,null,null,null,null,null,null,null,null,null,null,null,null,null,null,"HONDA",9,"CIVIC",2,"SEDAN"]
[null,null,null,null,null,null,null,null,null,null,null,null,null,null,null,null,null,null,null,null,null,null,null,null,null,null,null,"HONDA",9,"ACCORD",3,"SEDAN"]
[null,null,null,null,null,null,null,null,null,null,null,null,null,null,null,null,null,null,null,null,null,null,null,null,null,null,null,"HONDA",9,"INTEGRA",6,"SEDAN"]
[null,null,null,null,null,null,null,null,null,null,null,null,null,null,null,null,null,null,null,null,null,null,null,null,null,null,null,"HONDA",9,"PRELUDE",7,"COUPE"]
[null,null,null,null,null,null,null,null,null,null,null,null,null,null,null,null,null,null,null,null,null,null,null,null,null,null,null,"HONDA",9,"ACURA",9,"SEDAN"]
[null,null,null,null,null,null,null,null,null,null,null,null,null,null,null,null,null,null,null,null,null,null,null,null,null,null,null,"HONDA",9,"ODYSSEY",11,"MINI VAN"]
[null,null,null,null,null,null,null,null,null,null,null,null,null,null,null,null,null,null,null,null,null,null,null,null,null,null,null,"HONDA",9,"CIVIC DEL SOL",14,"COUPE"]
[null,null,null,null,null,null,null,null,null,null,null,null,null,null,null,null,null,null,null,null,null,null,null,null,null,null,null,"HONDA",9,"FIT",17,"SEDAN"]
[null,null,null,null,null,null,null,null,null,null,null,null,null,null,null,null,null,null,null,null,null,null,null,null,null,null,null,"HONDA",9,"PILOT",20,"SEDAN"]
[null,null,null,null,null,null,null,null,null,null,null,null,null,null,null,null,null,null,null,null,null,null,null,null,null,null,null,"HONDA",9,"LEGEND",21,"SEDAN"]
[null,null,null,null,null,null,null,null,null,null,null,null,null,null,null,null,null,null,null,null,null,null,null,null,null,null,null,"HONDA",9,"CRV 4X2",28,"JEEP"]
[null,null,null,null,null,null,null,null,null,null,null,null,null,null,null,null,null,null,null,null,null,null,null,null,null,null,null,"HUMMER",115,"H2 UTILITY WAGON 4WD",1,"JEEP"]
[null,null,null,null,null,null,null,null,null,null,null,null,null,null,null,null,null,null,null,null,null,null,null,null,null,null,null,"HYUNDAI",10,"ACCENT",1,"SEDAN"]
[null,null,null,null,null,null,null,null,null,null,null,null,null,null,null,null,null,null,null,null,null,null,null,null,null,null,null,"HYUNDAI",10,"ACCENT VERNA",2,"SEDAN"]
[null,null,null,null,null,null,null,null,null,null,null,null,null,null,null,null,null,null,null,null,null,null,null,null,null,null,null,"HYUNDAI",10,"SANTA FE 4X4",3,"JEEP"]
[null,null,null,null,null,null,null,null,null,null,null,null,null,null,null,null,null,null,null,null,null,null,null,null,null,null,null,"HYUNDAI",10,"EXCEL 4P",4,"SEDAN"]
[null,null,null,null,null,null,null,null,null,null,null,null,null,null,null,null,null,null,null,null,null,null,null,null,null,null,null,"HYUNDAI",10,"EXCEL 5P",5,"SEDAN"]
[null,null,null,null,null,null,null,null,null,null,null,null,null,null,null,null,null,null,null,null,null,null,null,null,null,null,null,"HYUNDAI",10,"ELANTRA",6,"SEDAN"]
[null,null,null,null,null,null,null,null,null,null,null,null,null,null,null,null,null,null,null,null,null,null,null,null,null,null,null,"HYUNDAI",10,"ATOS",7,"SEDAN"]
[null,null,null,null,null,null,null,null,null,null,null,null,null,null,null,null,null,null,null,null,null,null,null,null,null,null,null,"HYUNDAI",10,"ATOS SEMIFULL",8,"SEDAN"]
[null,null,null,null,null,null,null,null,null,null,null,null,null,null,null,null,null,null,null,null,null,null,null,null,null,null,null,"HYUNDAI",10,"ELANTRA AVANTE",9,"SEDAN"]
[null,null,null,null,null,null,null,null,null,null,null,null,null,null,null,null,null,null,null,null,null,null,null,null,null,null,null,"HYUNDAI",10,"GALLOPER",10,"JEEP"]
[null,null,null,null,null,null,null,null,null,null,null,null,null,null,null,null,null,null,null,null,null,null,null,null,null,null,null,"HYUNDAI",10,"PONNY",14,"COUPE"]
[null,null,null,null,null,null,null,null,null,null,null,null,null,null,null,null,null,null,null,null,null,null,null,null,null,null,null,"HYUNDAI",10,"SCOUPE",15,"COUPE"]
[null,null,null,null,null,null,null,null,null,null,null,null,null,null,null,null,null,null,null,null,null,null,null,null,null,null,null,"HYUNDAI",10,"SONATA",16,"SEDAN"]
[null,null,null,null,null,null,null,null,null,null,null,null,null,null,null,null,null,null,null,null,null,null,null,null,null,null,null,"HYUNDAI",10,"GRAND SALOON",19,"SEDAN"]
[null,null,null,null,null,null,null,null,null,null,null,null,null,null,null,null,null,null,null,null,null,null,null,null,null,null,null,"HYUNDAI",10,"TERRACAN",20,"JEEP"]
[null,null,null,null,null,null,null,null,null,null,null,null,null,null,null,null,null,null,null,null,null,null,null,null,null,null,null,"HYUNDAI",10,"MATRIX",21,"MINI VAN"]
[null,null,null,null,null,null,null,null,null,null,null,null,null,null,null,null,null,null,null,null,null,null,null,null,null,null,null,"HYUNDAI",10,"SANTAMO",24,"SEDAN"]
[null,null,null,null,null,null,null,null,null,null,null,null,null,null,null,null,null,null,null,null,null,null,null,null,null,null,null,"HYUNDAI",10,"GETZ",25,"SEDAN"]
[null,null,null,null,null,null,null,null,null,null,null,null,null,null,null,null,null,null,null,null,null,null,null,null,null,null,null,"HYUNDAI",10,"TRAJET",26,"SEDAN"]
[null,null,null,null,null,null,null,null,null,null,null,null,null,null,null,null,null,null,null,null,null,null,null,null,null,null,null,"HYUNDAI",10,"HI",27,"SEDAN"]
[null,null,null,null,null,null,null,null,null,null,null,null,null,null,null,null,null,null,null,null,null,null,null,null,null,null,null,"HYUNDAI",10,"WINDOW VAN",28,"MINI VAN"]
[null,null,null,null,null,null,null,null,null,null,null,null,null,null,null,null,null,null,null,null,null,null,null,null,null,null,null,"HYUNDAI",10,"SANTA FE 4X2",29,"JEEP"]
[null,null,null,null,null,null,null,null,null,null,null,null,null,null,null,null,null,null,null,null,null,null,null,null,null,null,null,"HYUNDAI",10,"TUCSON",30,"JEEP"]
[null,null,null,null,null,null,null,null,null,null,null,null,null,null,null,null,null,null,null,null,null,null,null,null,null,null,null,"INTERNATIONAL",44,"SCOUT II",3,"JEEP"]
[null,null,null,null,null,null,null,null,null,null,null,null,null,null,null,null,null,null,null,null,null,null,null,null,null,null,null,"ISUZU",34,"NPR NLD",1,"PICK-UP"]
[null,null,null,null,null,null,null,null,null,null,null,null,null,null,null,null,null,null,null,null,null,null,null,null,null,null,null,"ISUZU",34,"RODEO",2,"JEEP"]
[null,null,null,null,null,null,null,null,null,null,null,null,null,null,null,null,null,null,null,null,null,null,null,null,null,null,null,"ISUZU",34,"TROOPER",3,"JEEP"]
[null,null,null,null,null,null,null,null,null,null,null,null,null,null,null,null,null,null,null,null,null,null,null,null,null,null,null,"JAGUAR",35,"J6",1,"SEDAN"]
[null,null,null,null,null,null,null,null,null,null,null,null,null,null,null,null,null,null,null,null,null,null,null,null,null,null,null,"JEEP",71,"WILLYS",1,"JEEP"]
[null,null,null,null,null,null,null,null,null,null,null,null,null,null,null,null,null,null,null,null,null,null,null,null,null,null,null,"JEEP",71,"WRANGLER",2,"JEEP"]
[null,null,null,null,null,null,null,null,null,null,null,null,null,null,null,null,null,null,null,null,null,null,null,null,null,null,null,"JEEP",71,"WRANGLER SAHARA",3,"JEEP"]
[null,null,null,null,null,null,null,null,null,null,null,null,null,null,null,null,null,null,null,null,null,null,null,null,null,null,null,"JEEP",71,"CHEROKEE RENEGADE",4,"JEEP"]
[null,null,null,null,null,null,null,null,null,null,null,null,null,null,null,null,null,null,null,null,null,null,null,null,null,null,null,"JEEP",71,"CHEROKEE",5,"JEEP"]
[null,null,null,null,null,null,null,null,null,null,null,null,null,null,null,null,null,null,null,null,null,null,null,null,null,null,null,"JEEP",71,"GRAND CHEROKEE",6,"JEEP"]
[null,null,null,null,null,null,null,null,null,null,null,null,null,null,null,null,null,null,null,null,null,null,null,null,null,null,null,"JEEP",71,"LIBERTY LIMITED",7,"JEEP"]
[null,null,null,null,null,null,null,null,null,null,null,null,null,null,null,null,null,null,null,null,null,null,null,null,null,null,null,"JEEP",71,"GRAND WAGONER",8,"JEEP"]
[null,null,null,null,null,null,null,null,null,null,null,null,null,null,null,null,null,null,null,null,null,null,null,null,null,null,null,"KIA",11,"SPORTAGE 4X4",1,"JEEP"]
[null,null,null,null,null,null,null,null,null,null,null,null,null,null,null,null,null,null,null,null,null,null,null,null,null,null,null,"KIA",11,"CARENS",2,"MINI VAN"]
[null,null,null,null,null,null,null,null,null,null,null,null,null,null,null,null,null,null,null,null,null,null,null,null,null,null,null,"KIA",11,"RIO 4P",3,"SEDAN"]
[null,null,null,null,null,null,null,null,null,null,null,null,null,null,null,null,null,null,null,null,null,null,null,null,null,null,null,"KIA",11,"CARNIVAL",4,"MINI VAN"]
[null,null,null,null,null,null,null,null,null,null,null,null,null,null,null,null,null,null,null,null,null,null,null,null,null,null,null,"KIA",11,"PRIDE POP",8,"COUPE"]
[null,null,null,null,null,null,null,null,null,null,null,null,null,null,null,null,null,null,null,null,null,null,null,null,null,null,null,"KIA",11,"SHEPIA",9,"SEDAN"]
[null,null,null,null,null,null,null,null,null,null,null,null,null,null,null,null,null,null,null,null,null,null,null,null,null,null,null,"KIA",11,"CERES 4X2",10,"PICK-UP"]
[null,null,null,null,null,null,null,null,null,null,null,null,null,null,null,null,null,null,null,null,null,null,null,null,null,null,null,"KIA",11,"K2700 C/S",11,"PICK-UP"]
[null,null,null,null,null,null,null,null,null,null,null,null,null,null,null,null,null,null,null,null,null,null,null,null,null,null,null,"KIA",11,"K2400 C/S",12,"PICK-UP"]
[null,null,null,null,null,null,null,null,null,null,null,null,null,null,null,null,null,null,null,null,null,null,null,null,null,null,null,"KIA",11,"K3600",13,"PICK-UP"]
[null,null,null,null,null,null,null,null,null,null,null,null,null,null,null,null,null,null,null,null,null,null,null,null,null,null,null,"KIA",11,"SPECTRA",14,"SEDAN"]
[null,null,null,null,null,null,null,null,null,null,null,null,null,null,null,null,null,null,null,null,null,null,null,null,null,null,null,"KIA",11,"SORENTO",17,"JEEP"]
[null,null,null,null,null,null,null,null,null,null,null,null,null,null,null,null,null,null,null,null,null,null,null,null,null,null,null,"KIA",11,"RIO STYLUS",18,"SEDAN"]
[null,null,null,null,null,null,null,null,null,null,null,null,null,null,null,null,null,null,null,null,null,null,null,null,null,null,null,"KIA",11,"PICANTO",19,"SEDAN"]
[null,null,null,null,null,null,null,null,null,null,null,null,null,null,null,null,null,null,null,null,null,null,null,null,null,null,null,"KIA",11,"CERATO",20,"SEDAN"]
[null,null,null,null,null,null,null,null,null,null,null,null,null,null,null,null,null,null,null,null,null,null,null,null,null,null,null,"LADA",13,2107,1,"SEDAN"]
[null,null,null,null,null,null,null,null,null,null,null,null,null,null,null,null,null,null,null,null,null,null,null,null,null,null,null,"LADA",13,"NIVA",2,"JEEP"]
[null,null,null,null,null,null,null,null,null,null,null,null,null,null,null,null,null,null,null,null,null,null,null,null,null,null,null,"LADA",13,2104,3,"SEDAN"]
[null,null,null,null,null,null,null,null,null,null,null,null,null,null,null,null,null,null,null,null,null,null,null,null,null,null,null,"LADA",13,2106,4,"SEDAN"]
[null,null,null,null,null,null,null,null,null,null,null,null,null,null,null,null,null,null,null,null,null,null,null,null,null,null,null,"LADA",13,2109,5,"SEDAN"]
[null,null,null,null,null,null,null,null,null,null,null,null,null,null,null,null,null,null,null,null,null,null,null,null,null,null,null,"LADA",13,1600,6,"SEDAN"]
[null,null,null,null,null,null,null,null,null,null,null,null,null,null,null,null,null,null,null,null,null,null,null,null,null,null,null,"LADA",13,2105,7,"SEDAN"]
[null,null,null,null,null,null,null,null,null,null,null,null,null,null,null,null,null,null,null,null,null,null,null,null,null,null,null,"LADA",13,2101,8,"SEDAN"]
[null,null,null,null,null,null,null,null,null,null,null,null,null,null,null,null,null,null,null,null,null,null,null,null,null,null,null,"LADA",13,"100 SEDAN",9,"SEDAN"]
[null,null,null,null,null,null,null,null,null,null,null,null,null,null,null,null,null,null,null,null,null,null,null,null,null,null,null,"LADA",13,2110,10,"SEDAN"]
[null,null,null,null,null,null,null,null,null,null,null,null,null,null,null,null,null,null,null,null,null,null,null,null,null,null,null,"LADA",13,110,11,"SEDAN"]
[null,null,null,null,null,null,null,null,null,null,null,null,null,null,null,null,null,null,null,null,null,null,null,null,null,null,null,"LADA",13,2112,12,"STATION WAGON"]
[null,null,null,null,null,null,null,null,null,null,null,null,null,null,null,null,null,null,null,null,null,null,null,null,null,null,null,"LADA",13,"100 STATION WAGON",13,"STATION WAGON"]
[null,null,null,null,null,null,null,null,null,null,null,null,null,null,null,null,null,null,null,null,null,null,null,null,null,null,null,"LADA",13,21102,14,"SEDAN"]
[null,null,null,null,null,null,null,null,null,null,null,null,null,null,null,null,null,null,null,null,null,null,null,null,null,null,null,"LADA",13,115,15,"SEDAN"]
[null,null,null,null,null,null,null,null,null,null,null,null,null,null,null,null,null,null,null,null,null,null,null,null,null,null,null,"LADA",13,21122,16,"SEDAN"]
[null,null,null,null,null,null,null,null,null,null,null,null,null,null,null,null,null,null,null,null,null,null,null,null,null,null,null,"LANCIA",36,"AUTOBIANCHI",1,"COUPE"]
[null,null,null,null,null,null,null,null,null,null,null,null,null,null,null,null,null,null,null,null,null,null,null,null,null,null,null,"LAND ROVER",12,"FREELANDER",1,"JEEP"]
[null,null,null,null,null,null,null,null,null,null,null,null,null,null,null,null,null,null,null,null,null,null,null,null,null,null,null,"LAND ROVER",12,"DISCOVERY",2,"JEEP"]
[null,null,null,null,null,null,null,null,null,null,null,null,null,null,null,null,null,null,null,null,null,null,null,null,null,null,null,"LAND ROVER",12,"RANGE ROVER",3,"JEEP"]
[null,null,null,null,null,null,null,null,null,null,null,null,null,null,null,null,null,null,null,null,null,null,null,null,null,null,null,"LAND ROVER",12,"ROVER 400",4,"JEEP"]
[null,null,null,null,null,null,null,null,null,null,null,null,null,null,null,null,null,null,null,null,null,null,null,null,null,null,null,"LAND ROVER",12,"DEFENDER",5,"JEEP"]
[null,null,null,null,null,null,null,null,null,null,null,null,null,null,null,null,null,null,null,null,null,null,null,null,null,null,null,"LAND ROVER",12,"VOGUE",6,"JEEP"]
[null,null,null,null,null,null,null,null,null,null,null,null,null,null,null,null,null,null,null,null,null,null,null,null,null,null,null,"LEXUS",37,"LX 470",1,"JEEP"]
[null,null,null,null,null,null,null,null,null,null,null,null,null,null,null,null,null,null,null,null,null,null,null,null,null,null,null,"LINCOLN",38,"NAVIGATOR",1,"JEEP"]
[null,null,null,null,null,null,null,null,null,null,null,null,null,null,null,null,null,null,null,null,null,null,null,null,null,null,null,"MAHINDRA",101,"SCORPIO LHD",1,"JEEP"]
[null,null,null,null,null,null,null,null,null,null,null,null,null,null,null,null,null,null,null,null,null,null,null,null,null,null,null,"MAZDA",14,"323 3P",1,"COUPE"]
[null,null,null,null,null,null,null,null,null,null,null,null,null,null,null,null,null,null,null,null,null,null,null,null,null,null,null,"MAZDA",14,"323 4P",2,"SEDAN"]
[null,null,null,null,null,null,null,null,null,null,null,null,null,null,null,null,null,null,null,null,null,null,null,null,null,null,null,"MAZDA",14,"323 5P",3,"STATION WAGON"]
[null,null,null,null,null,null,null,null,null,null,null,null,null,null,null,null,null,null,null,null,null,null,null,null,null,null,null,"MAZDA",14,"323 ALLEGRO 4P",4,"SEDAN"]
[null,null,null,null,null,null,null,null,null,null,null,null,null,null,null,null,null,null,null,null,null,null,null,null,null,null,null,"MAZDA",14,"323 ALLEGRO 5P",5,"STATION WAGON"]
[null,null,null,null,null,null,null,null,null,null,null,null,null,null,null,null,null,null,null,null,null,null,null,null,null,null,null,"MAZDA",14,626,6,"SEDAN"]
[null,null,null,null,null,null,null,null,null,null,null,null,null,null,null,null,null,null,null,null,null,null,null,null,null,null,null,"MAZDA",14,"B2200I C/S 4X2",7,"PICK-UP"]
[null,null,null,null,null,null,null,null,null,null,null,null,null,null,null,null,null,null,null,null,null,null,null,null,null,null,null,"MAZDA",14,"B2200I D/C 4X2",8,"PICK-UP"]
[null,null,null,null,null,null,null,null,null,null,null,null,null,null,null,null,null,null,null,null,null,null,null,null,null,null,null,"MAZDA",14,"B2600I C/S 4X4",9,"PICK-UP"]
[null,null,null,null,null,null,null,null,null,null,null,null,null,null,null,null,null,null,null,null,null,null,null,null,null,null,null,"MAZDA",14,"B2600I D/C 4X4",10,"PICK-UP"]
[null,null,null,null,null,null,null,null,null,null,null,null,null,null,null,null,null,null,null,null,null,null,null,null,null,null,null,"MAZDA",14,"B2000 C/S 4X2",11,"PICK-UP"]
[null,null,null,null,null,null,null,null,null,null,null,null,null,null,null,null,null,null,null,null,null,null,null,null,null,null,null,"MAZDA",14,"B2000 D/C 4X2",12,"PICK-UP"]
[null,null,null,null,null,null,null,null,null,null,null,null,null,null,null,null,null,null,null,null,null,null,null,null,null,null,null,"MAZDA",14,"PROTEGE",13,"COUPE"]
[null,null,null,null,null,null,null,null,null,null,null,null,null,null,null,null,null,null,null,null,null,null,null,null,null,null,null,"MAZDA",14,"MATSURI",14,"SEDAN"]
[null,null,null,null,null,null,null,null,null,null,null,null,null,null,null,null,null,null,null,null,null,null,null,null,null,null,null,"MAZDA",14,"MX3",15,"COUPE"]
[null,null,null,null,null,null,null,null,null,null,null,null,null,null,null,null,null,null,null,null,null,null,null,null,null,null,null,"MAZDA",14,"MPV VAN",16,"MINI VAN"]
[null,null,null,null,null,null,null,null,null,null,null,null,null,null,null,null,null,null,null,null,null,null,null,null,null,null,null,"MAZDA",14,"B2500 C/S",17,"PICK-UP"]
[null,null,null,null,null,null,null,null,null,null,null,null,null,null,null,null,null,null,null,null,null,null,null,null,null,null,null,"MAZDA",14,"B2500 C/D",18,"PICK-UP"]
[null,null,null,null,null,null,null,null,null,null,null,null,null,null,null,null,null,null,null,null,null,null,null,null,null,null,null,"MAZDA",14,"TRIBUTE AT SDX",20,"JEEP"]
[null,null,null,null,null,null,null,null,null,null,null,null,null,null,null,null,null,null,null,null,null,null,null,null,null,null,null,"MAZDA",14,"CIAO TEMPO 1.3 CC",21,"SEDAN"]
[null,null,null,null,null,null,null,null,null,null,null,null,null,null,null,null,null,null,null,null,null,null,null,null,null,null,null,"MAZDA",14,929,22,"SEDAN"]
[null,null,null,null,null,null,null,null,null,null,null,null,null,null,null,null,null,null,null,null,null,null,null,null,null,null,null,"MAZDA",14,"B29DCP",23,"PICK-UP"]
[null,null,null,null,null,null,null,null,null,null,null,null,null,null,null,null,null,null,null,null,null,null,null,null,null,null,null,"MAZDA",14,"MIATA MX5",24,"COUPE"]
[null,null,null,null,null,null,null,null,null,null,null,null,null,null,null,null,null,null,null,null,null,null,null,null,null,null,null,"MAZDA",14,"6 2.0",25,"SEDAN"]
[null,null,null,null,null,null,null,null,null,null,null,null,null,null,null,null,null,null,null,null,null,null,null,null,null,null,null,"MAZDA",14,"RX8",26,"COUPE"]
[null,null,null,null,null,null,null,null,null,null,null,null,null,null,null,null,null,null,null,null,null,null,null,null,null,null,null,"MERCEDES BENZ",15,"190E",1,"SEDAN"]
[null,null,null,null,null,null,null,null,null,null,null,null,null,null,null,null,null,null,null,null,null,null,null,null,null,null,null,"MERCEDES BENZ",15,"A160 CLASSIC",2,"SEDAN"]
[null,null,null,null,null,null,null,null,null,null,null,null,null,null,null,null,null,null,null,null,null,null,null,null,null,null,null,"MERCEDES BENZ",15,"C200 KOMPRESOR",3,"SEDAN"]
[null,null,null,null,null,null,null,null,null,null,null,null,null,null,null,null,null,null,null,null,null,null,null,null,null,null,null,"MERCEDES BENZ",15,"C240",4,"SEDAN"]
[null,null,null,null,null,null,null,null,null,null,null,null,null,null,null,null,null,null,null,null,null,null,null,null,null,null,null,"MERCEDES BENZ",15,"C320",5,"SEDAN"]
[null,null,null,null,null,null,null,null,null,null,null,null,null,null,null,null,null,null,null,null,null,null,null,null,null,null,null,"MERCEDES BENZ",15,"E320",6,"SEDAN"]
[null,null,null,null,null,null,null,null,null,null,null,null,null,null,null,null,null,null,null,null,null,null,null,null,null,null,null,"MERCEDES BENZ",15,"ML 320 (4X4)",7,"JEEP"]
[null,null,null,null,null,null,null,null,null,null,null,null,null,null,null,null,null,null,null,null,null,null,null,null,null,null,null,"MERCEDES BENZ",15,"ML 430 (4X4)",8,"JEEP"]
[null,null,null,null,null,null,null,null,null,null,null,null,null,null,null,null,null,null,null,null,null,null,null,null,null,null,null,"MERCEDES BENZ",15,"C230 KOMPRESOR",9,"SEDAN"]
[null,null,null,null,null,null,null,null,null,null,null,null,null,null,null,null,null,null,null,null,null,null,null,null,null,null,null,"MERCEDES BENZ",15,260,10,"SEDAN"]
[null,null,null,null,null,null,null,null,null,null,null,null,null,null,null,null,null,null,null,null,null,null,null,null,null,null,null,"MERCEDES BENZ",15,"SERIE G (4X4) 5P.",11,"SEDAN"]
[null,null,null,null,null,null,null,null,null,null,null,null,null,null,null,null,null,null,null,null,null,null,null,null,null,null,null,"MERCEDES BENZ",15,"C280 - 280",12,"SEDAN"]
[null,null,null,null,null,null,null,null,null,null,null,null,null,null,null,null,null,null,null,null,null,null,null,null,null,null,null,"MERCEDES BENZ",15,"200E",13,"SEDAN"]
[null,null,null,null,null,null,null,null,null,null,null,null,null,null,null,null,null,null,null,null,null,null,null,null,null,null,null,"MERCEDES BENZ",15,"280E",14,"SEDAN"]
[null,null,null,null,null,null,null,null,null,null,null,null,null,null,null,null,null,null,null,null,null,null,null,null,null,null,null,"MERCEDES BENZ",15,"250E",15,"SEDAN"]
[null,null,null,null,null,null,null,null,null,null,null,null,null,null,null,null,null,null,null,null,null,null,null,null,null,null,null,"MERCEDES BENZ",15,"260E",16,"SEDAN"]
[null,null,null,null,null,null,null,null,null,null,null,null,null,null,null,null,null,null,null,null,null,null,null,null,null,null,null,"MERCEDES BENZ",15,"300E",17,"SEDAN"]
[null,null,null,null,null,null,null,null,null,null,null,null,null,null,null,null,null,null,null,null,null,null,null,null,null,null,null,"MERCEDES BENZ",15,"C220",18,"SEDAN"]
[null,null,null,null,null,null,null,null,null,null,null,null,null,null,null,null,null,null,null,null,null,null,null,null,null,null,null,"MERCEDES BENZ",15,430,19,"SEDAN"]
[null,null,null,null,null,null,null,null,null,null,null,null,null,null,null,null,null,null,null,null,null,null,null,null,null,null,null,"MERCEDES BENZ",15,"230 F",20,"SEDAN"]
[null,null,null,null,null,null,null,null,null,null,null,null,null,null,null,null,null,null,null,null,null,null,null,null,null,null,null,"MERCEDES BENZ",15,"300SE",21,"SEDAN"]
[null,null,null,null,null,null,null,null,null,null,null,null,null,null,null,null,null,null,null,null,null,null,null,null,null,null,null,"MERCEDES BENZ",15,"C200",22,"SEDAN"]
[null,null,null,null,null,null,null,null,null,null,null,null,null,null,null,null,null,null,null,null,null,null,null,null,null,null,null,"MERCEDES BENZ",15,"SLK 230",23,"COUPE"]
[null,null,null,null,null,null,null,null,null,null,null,null,null,null,null,null,null,null,null,null,null,null,null,null,null,null,null,"MERCEDES BENZ",15,"C230",24,"SEDAN"]
[null,null,null,null,null,null,null,null,null,null,null,null,null,null,null,null,null,null,null,null,null,null,null,null,null,null,null,"MERCEDES BENZ",15,220,25,"SEDAN"]
[null,null,null,null,null,null,null,null,null,null,null,null,null,null,null,null,null,null,null,null,null,null,null,null,null,null,null,"MERCEDES BENZ",15,"230E",26,"SEDAN"]
[null,null,null,null,null,null,null,null,null,null,null,null,null,null,null,null,null,null,null,null,null,null,null,null,null,null,null,"MERCEDES BENZ",15,"500SEL",28,"SEDAN"]
[null,null,null,null,null,null,null,null,null,null,null,null,null,null,null,null,null,null,null,null,null,null,null,null,null,null,null,"MERCEDES BENZ",15,"240E",29,"SEDAN"]
[null,null,null,null,null,null,null,null,null,null,null,null,null,null,null,null,null,null,null,null,null,null,null,null,null,null,null,"MERCEDES BENZ",15,"ML 500",30,"SEDAN"]
[null,null,null,null,null,null,null,null,null,null,null,null,null,null,null,null,null,null,null,null,null,null,null,null,null,null,null,"MERCEDES BENZ",15,"C230K",31,"SEDAN"]
[null,null,null,null,null,null,null,null,null,null,null,null,null,null,null,null,null,null,null,null,null,null,null,null,null,null,null,"MERCEDES BENZ",15,"ML230",32,"JEEP"]
[null,null,null,null,null,null,null,null,null,null,null,null,null,null,null,null,null,null,null,null,null,null,null,null,null,null,null,"MERCEDES BENZ",15,"C180",35,"SEDAN"]
[null,null,null,null,null,null,null,null,null,null,null,null,null,null,null,null,null,null,null,null,null,null,null,null,null,null,null,"MERCEDES BENZ",15,"ML 350",37,"JEEP"]
[null,null,null,null,null,null,null,null,null,null,null,null,null,null,null,null,null,null,null,null,null,null,null,null,null,null,null,"MERCEDES BENZ",15,"CLK320",38,"SEDAN"]
[null,null,null,null,null,null,null,null,null,null,null,null,null,null,null,null,null,null,null,null,null,null,null,null,null,null,null,"MITSUBISHI",16,"L-200 4X2 C/S",1,"PICK-UP"]
[null,null,null,null,null,null,null,null,null,null,null,null,null,null,null,null,null,null,null,null,null,null,null,null,null,null,null,"MITSUBISHI",16,"L-200 4X2 D/C",2,"PICK-UP"]
[null,null,null,null,null,null,null,null,null,null,null,null,null,null,null,null,null,null,null,null,null,null,null,null,null,null,null,"MITSUBISHI",16,"L-200 4X4 C/S",3,"PICK-UP"]
[null,null,null,null,null,null,null,null,null,null,null,null,null,null,null,null,null,null,null,null,null,null,null,null,null,null,null,"MITSUBISHI",16,"L-200 4X4 D/C",4,"PICK-UP"]
[null,null,null,null,null,null,null,null,null,null,null,null,null,null,null,null,null,null,null,null,null,null,null,null,null,null,null,"MITSUBISHI",16,"LANCER",5,"SEDAN"]
[null,null,null,null,null,null,null,null,null,null,null,null,null,null,null,null,null,null,null,null,null,null,null,null,null,null,null,"MITSUBISHI",16,"SPACE WAGON 5P",6,"MINI VAN"]
[null,null,null,null,null,null,null,null,null,null,null,null,null,null,null,null,null,null,null,null,null,null,null,null,null,null,null,"MITSUBISHI",16,"MONTERO 3P",7,"JEEP"]
[null,null,null,null,null,null,null,null,null,null,null,null,null,null,null,null,null,null,null,null,null,null,null,null,null,null,null,"MITSUBISHI",16,"MONTERO 5P",8,"JEEP"]
[null,null,null,null,null,null,null,null,null,null,null,null,null,null,null,null,null,null,null,null,null,null,null,null,null,null,null,"MITSUBISHI",16,"MONTERO SPORT",9,"JEEP"]
[null,null,null,null,null,null,null,null,null,null,null,null,null,null,null,null,null,null,null,null,null,null,null,null,null,null,null,"MITSUBISHI",16,"GALANT",11,"SEDAN"]
[null,null,null,null,null,null,null,null,null,null,null,null,null,null,null,null,null,null,null,null,null,null,null,null,null,null,null,"MITSUBISHI",16,"ECLIPSE SPYDER",12,"COUPE"]
[null,null,null,null,null,null,null,null,null,null,null,null,null,null,null,null,null,null,null,null,null,null,null,null,null,null,null,"MITSUBISHI",16,"L300 C/D",14,"PICK-UP"]
[null,null,null,null,null,null,null,null,null,null,null,null,null,null,null,null,null,null,null,null,null,null,null,null,null,null,null,"MITSUBISHI",16,"L400 C/S",15,"PICK-UP"]
[null,null,null,null,null,null,null,null,null,null,null,null,null,null,null,null,null,null,null,null,null,null,null,null,null,null,null,"MITSUBISHI",16,"L400 D/C",16,"PICK-UP"]
[null,null,null,null,null,null,null,null,null,null,null,null,null,null,null,null,null,null,null,null,null,null,null,null,null,null,null,"MITSUBISHI",16,"MONTERO IO",17,"JEEP"]
[null,null,null,null,null,null,null,null,null,null,null,null,null,null,null,null,null,null,null,null,null,null,null,null,null,null,null,"MITSUBISHI",16,"OUTLANDER",18,"MINI VAN"]
[null,null,null,null,null,null,null,null,null,null,null,null,null,null,null,null,null,null,null,null,null,null,null,null,null,null,null,"NISSAN",17,"1200 P/U",1,"PICK-UP"]
[null,null,null,null,null,null,null,null,null,null,null,null,null,null,null,null,null,null,null,null,null,null,null,null,null,null,null,"NISSAN",17,"2400 C/S 4X2",2,"PICK-UP"]
[null,null,null,null,null,null,null,null,null,null,null,null,null,null,null,null,null,null,null,null,null,null,null,null,null,null,null,"NISSAN",17,"2400 D/C 4X2",3,"PICK-UP"]
[null,null,null,null,null,null,null,null,null,null,null,null,null,null,null,null,null,null,null,null,null,null,null,null,null,null,null,"NISSAN",17,"2400 D/C 4X4",4,"PICK-UP"]
[null,null,null,null,null,null,null,null,null,null,null,null,null,null,null,null,null,null,null,null,null,null,null,null,null,null,null,"NISSAN",17,"PATHFINDER",5,"JEEP"]
[null,null,null,null,null,null,null,null,null,null,null,null,null,null,null,null,null,null,null,null,null,null,null,null,null,null,null,"NISSAN",17,"PATHFINDER FULL",6,"JEEP"]
[null,null,null,null,null,null,null,null,null,null,null,null,null,null,null,null,null,null,null,null,null,null,null,null,null,null,null,"NISSAN",17,"PATROL 3P",7,"JEEP"]
[null,null,null,null,null,null,null,null,null,null,null,null,null,null,null,null,null,null,null,null,null,null,null,null,null,null,null,"NISSAN",17,"PATROL 5P",8,"JEEP"]
[null,null,null,null,null,null,null,null,null,null,null,null,null,null,null,null,null,null,null,null,null,null,null,null,null,null,null,"NISSAN",17,"SENTRA I",9,"SEDAN"]
[null,null,null,null,null,null,null,null,null,null,null,null,null,null,null,null,null,null,null,null,null,null,null,null,null,null,null,"NISSAN",17,"SENTRA II",10,"SEDAN"]
[null,null,null,null,null,null,null,null,null,null,null,null,null,null,null,null,null,null,null,null,null,null,null,null,null,null,null,"NISSAN",17,"ALMERA",11,"SEDAN"]
[null,null,null,null,null,null,null,null,null,null,null,null,null,null,null,null,null,null,null,null,null,null,null,null,null,null,null,"NISSAN",17,"ALTIMA",12,"SEDAN"]
[null,null,null,null,null,null,null,null,null,null,null,null,null,null,null,null,null,null,null,null,null,null,null,null,null,null,null,"NISSAN",17,"BLUEBIRD",14,"SEDAN"]
[null,null,null,null,null,null,null,null,null,null,null,null,null,null,null,null,null,null,null,null,null,null,null,null,null,null,null,"NISSAN",17,"INFINITY",19,"SEDAN"]
[null,null,null,null,null,null,null,null,null,null,null,null,null,null,null,null,null,null,null,null,null,null,null,null,null,null,null,"NISSAN",17,"LB120",21,"PICK-UP"]
[null,null,null,null,null,null,null,null,null,null,null,null,null,null,null,null,null,null,null,null,null,null,null,null,null,null,null,"NISSAN",17,"MAXIMA",22,"SEDAN"]
[null,null,null,null,null,null,null,null,null,null,null,null,null,null,null,null,null,null,null,null,null,null,null,null,null,null,null,"NISSAN",17,"PRIMERA",23,"SEDAN"]
[null,null,null,null,null,null,null,null,null,null,null,null,null,null,null,null,null,null,null,null,null,null,null,null,null,null,null,"NISSAN",17,"QUEST",24,"MINI VAN"]
[null,null,null,null,null,null,null,null,null,null,null,null,null,null,null,null,null,null,null,null,null,null,null,null,null,null,null,"NISSAN",17,"SUNNY",25,"SEDAN"]
[null,null,null,null,null,null,null,null,null,null,null,null,null,null,null,null,null,null,null,null,null,null,null,null,null,null,null,"NISSAN",17,"1800 C/S",27,"PICK-UP"]
[null,null,null,null,null,null,null,null,null,null,null,null,null,null,null,null,null,null,null,null,null,null,null,null,null,null,null,"NISSAN",17,"1800 D/C",28,"PICK-UP"]
[null,null,null,null,null,null,null,null,null,null,null,null,null,null,null,null,null,null,null,null,null,null,null,null,null,null,null,"NISSAN",17,"TERRANO",29,"JEEP"]
[null,null,null,null,null,null,null,null,null,null,null,null,null,null,null,null,null,null,null,null,null,null,null,null,null,null,null,"NISSAN",17,"X.TRAIL",30,"JEEP"]
[null,null,null,null,null,null,null,null,null,null,null,null,null,null,null,null,null,null,null,null,null,null,null,null,null,null,null,"NISSAN",17,"SENTRA SWA",31,"STATION WAGON"]
[null,null,null,null,null,null,null,null,null,null,null,null,null,null,null,null,null,null,null,null,null,null,null,null,null,null,null,"NISSAN",17,"2000 C/S",32,"PICK-UP"]
[null,null,null,null,null,null,null,null,null,null,null,null,null,null,null,null,null,null,null,null,null,null,null,null,null,null,null,"NISSAN",17,"PICKUP 4X2 D/C",33,"PICK-UP"]
[null,null,null,null,null,null,null,null,null,null,null,null,null,null,null,null,null,null,null,null,null,null,null,null,null,null,null,"NISSAN",17,"FRONTIER C/D 4X4",34,"PICK-UP"]
[null,null,null,null,null,null,null,null,null,null,null,null,null,null,null,null,null,null,null,null,null,null,null,null,null,null,null,"NISSAN",17,"MURANO",36,"JEEP"]
[null,null,null,null,null,null,null,null,null,null,null,null,null,null,null,null,null,null,null,null,null,null,null,null,null,null,null,"NISSAN",17,"FRONTIER C/D 4X2",37,"PICK-UP"]
[null,null,null,null,null,null,null,null,null,null,null,null,null,null,null,null,null,null,null,null,null,null,null,null,null,null,null,"NISSAN",17,"CLD 211 S",38,"PICK-UP"]
[null,null,null,null,null,null,null,null,null,null,null,null,null,null,null,null,null,null,null,null,null,null,null,null,null,null,null,"NISSAN",17,"PICKUP 4X2 C/S",39,"PICK-UP"]
[null,null,null,null,null,null,null,null,null,null,null,null,null,null,null,null,null,null,null,null,null,null,null,null,null,null,null,"OLDSMOBIL",73,"SILHOUETTE",1,"SEDAN"]
[null,null,null,null,null,null,null,null,null,null,null,null,null,null,null,null,null,null,null,null,null,null,null,null,null,null,null,"OLTCIT",40,"CLUB 12TRS",1,"SEDAN"]
[null,null,null,null,null,null,null,null,null,null,null,null,null,null,null,null,null,null,null,null,null,null,null,null,null,null,null,"PEUGEOT",18,"306 5P",1,"SEDAN"]
[null,null,null,null,null,null,null,null,null,null,null,null,null,null,null,null,null,null,null,null,null,null,null,null,null,null,null,"PEUGEOT",18,"206 3P",2,"COUPE"]
[null,null,null,null,null,null,null,null,null,null,null,null,null,null,null,null,null,null,null,null,null,null,null,null,null,null,null,"PEUGEOT",18,"206 5P",3,"SEDAN"]
[null,null,null,null,null,null,null,null,null,null,null,null,null,null,null,null,null,null,null,null,null,null,null,null,null,null,null,"PEUGEOT",18,"406 4P",4,"SEDAN"]
[null,null,null,null,null,null,null,null,null,null,null,null,null,null,null,null,null,null,null,null,null,null,null,null,null,null,null,"PEUGEOT",18,405,5,"SEDAN"]
[null,null,null,null,null,null,null,null,null,null,null,null,null,null,null,null,null,null,null,null,null,null,null,null,null,null,null,"PEUGEOT",18,305,6,"SEDAN"]
[null,null,null,null,null,null,null,null,null,null,null,null,null,null,null,null,null,null,null,null,null,null,null,null,null,null,null,"PEUGEOT",18,504,7,"SEDAN"]
[null,null,null,null,null,null,null,null,null,null,null,null,null,null,null,null,null,null,null,null,null,null,null,null,null,null,null,"PEUGEOT",18,505,8,"SEDAN"]
[null,null,null,null,null,null,null,null,null,null,null,null,null,null,null,null,null,null,null,null,null,null,null,null,null,null,null,"PEUGEOT",18,604,9,"SEDAN"]
[null,null,null,null,null,null,null,null,null,null,null,null,null,null,null,null,null,null,null,null,null,null,null,null,null,null,null,"PEUGEOT",18,605,10,"SEDAN"]
[null,null,null,null,null,null,null,null,null,null,null,null,null,null,null,null,null,null,null,null,null,null,null,null,null,null,null,"PEUGEOT",18,806,11,"SEDAN"]
[null,null,null,null,null,null,null,null,null,null,null,null,null,null,null,null,null,null,null,null,null,null,null,null,null,null,null,"PEUGEOT",18,"BERLINA",12,"SEDAN"]
[null,null,null,null,null,null,null,null,null,null,null,null,null,null,null,null,null,null,null,null,null,null,null,null,null,null,null,"PEUGEOT",18,404,13,"PICK-UP"]
[null,null,null,null,null,null,null,null,null,null,null,null,null,null,null,null,null,null,null,null,null,null,null,null,null,null,null,"PEUGEOT",18,"106 XR",14,"SEDAN"]
[null,null,null,null,null,null,null,null,null,null,null,null,null,null,null,null,null,null,null,null,null,null,null,null,null,null,null,"PEUGEOT",18,"BREAK",15,"SEDAN"]
[null,null,null,null,null,null,null,null,null,null,null,null,null,null,null,null,null,null,null,null,null,null,null,null,null,null,null,"PEUGEOT",18,1600,16,"PICK-UP"]
[null,null,null,null,null,null,null,null,null,null,null,null,null,null,null,null,null,null,null,null,null,null,null,null,null,null,null,"PEUGEOT",18,"BREAK 307",17,"SEDAN"]
[null,null,null,null,null,null,null,null,null,null,null,null,null,null,null,null,null,null,null,null,null,null,null,null,null,null,null,"PEUGEOT",18,"S16 3P",18,"COUPE"]
[null,null,null,null,null,null,null,null,null,null,null,null,null,null,null,null,null,null,null,null,null,null,null,null,null,null,null,"PEUGEOT",18,307,19,"SEDAN"]
[null,null,null,null,null,null,null,null,null,null,null,null,null,null,null,null,null,null,null,null,null,null,null,null,null,null,null,"PEUGEOT",18,"807 ST 2.0 AT",20,"SEDAN"]
[null,null,null,null,null,null,null,null,null,null,null,null,null,null,null,null,null,null,null,null,null,null,null,null,null,null,null,"PLYMOUTH",54,"VOYAGER",1,"MINI VAN"]
[null,null,null,null,null,null,null,null,null,null,null,null,null,null,null,null,null,null,null,null,null,null,null,null,null,null,null,"PLYMOUTH",54,"GRAND VOYAGER",3,"MINI VAN"]
[null,null,null,null,null,null,null,null,null,null,null,null,null,null,null,null,null,null,null,null,null,null,null,null,null,null,null,"PORCHE",56,"BOXSTER 986",1,"COUPE"]
[null,null,null,null,null,null,null,null,null,null,null,null,null,null,null,null,null,null,null,null,null,null,null,null,null,null,null,"PORCHE",56,"CAYENNE",2,"JEEP"]
[null,null,null,null,null,null,null,null,null,null,null,null,null,null,null,null,null,null,null,null,null,null,null,null,null,null,null,"RENAULT",19,"TWINGO",1,"COUPE"]
[null,null,null,null,null,null,null,null,null,null,null,null,null,null,null,null,null,null,null,null,null,null,null,null,null,null,null,"RENAULT",19,"CLIO",2,"SEDAN"]
[null,null,null,null,null,null,null,null,null,null,null,null,null,null,null,null,null,null,null,null,null,null,null,null,null,null,null,"RENAULT",19,"CLIO FULL",3,"SEDAN"]
[null,null,null,null,null,null,null,null,null,null,null,null,null,null,null,null,null,null,null,null,null,null,null,null,null,null,null,"RENAULT",19,"SCENIC",4,"SEDAN"]
[null,null,null,null,null,null,null,null,null,null,null,null,null,null,null,null,null,null,null,null,null,null,null,null,null,null,null,"RENAULT",19,"MEGANE",5,"SEDAN"]
[null,null,null,null,null,null,null,null,null,null,null,null,null,null,null,null,null,null,null,null,null,null,null,null,null,null,null,"RENAULT",19,"KANGOO",6,"STATION WAGON"]
[null,null,null,null,null,null,null,null,null,null,null,null,null,null,null,null,null,null,null,null,null,null,null,null,null,null,null,"RENAULT",19,"LAGUNA",7,"SEDAN"]
[null,null,null,null,null,null,null,null,null,null,null,null,null,null,null,null,null,null,null,null,null,null,null,null,null,null,null,"RENAULT",19,"19 TRICORPS",8,"SEDAN"]
[null,null,null,null,null,null,null,null,null,null,null,null,null,null,null,null,null,null,null,null,null,null,null,null,null,null,null,"RENAULT",19,"SYMBOL",9,"SEDAN"]
[null,null,null,null,null,null,null,null,null,null,null,null,null,null,null,null,null,null,null,null,null,null,null,null,null,null,null,"SAAB",45,900,1,"SEDAN"]
[null,null,null,null,null,null,null,null,null,null,null,null,null,null,null,null,null,null,null,null,null,null,null,null,null,null,null,"SAAB",45,950,2,"SEDAN"]
[null,null,null,null,null,null,null,null,null,null,null,null,null,null,null,null,null,null,null,null,null,null,null,null,null,null,null,"SAEHAN",57,"N/D",1,"SEDAN"]
[null,null,null,null,null,null,null,null,null,null,null,null,null,null,null,null,null,null,null,null,null,null,null,null,null,null,null,"SAMSUNG",74,"SV-110",1,"SEDAN"]
[null,null,null,null,null,null,null,null,null,null,null,null,null,null,null,null,null,null,null,null,null,null,null,null,null,null,null,"SANGYONG",42,"MUSSO",1,"JEEP"]
[null,null,null,null,null,null,null,null,null,null,null,null,null,null,null,null,null,null,null,null,null,null,null,null,null,null,null,"SANGYONG",42,"REXTON RX320",2,"JEEP"]
[null,null,null,null,null,null,null,null,null,null,null,null,null,null,null,null,null,null,null,null,null,null,null,null,null,null,null,"SEAT",105,"COUPE",1,"COUPE"]
[null,null,null,null,null,null,null,null,null,null,null,null,null,null,null,null,null,null,null,null,null,null,null,null,null,null,null,"SKODA",20,"FELICIA",1,"SEDAN"]
[null,null,null,null,null,null,null,null,null,null,null,null,null,null,null,null,null,null,null,null,null,null,null,null,null,null,null,"SKODA",20,"1300 PICK UP",2,"PICK-UP"]
[null,null,null,null,null,null,null,null,null,null,null,null,null,null,null,"V2 - Producto Empresas",null,null,null,null,null,null,null,null,null,null,null,"SKODA",20,"FABIA",3,"SEDAN"]
[null,null,null,null,null,null,null,null,null,null,null,null,null,null,null,"Elaborado por: Cristina Aldás ",null,null,null,null,null,null,null,null,null,null,null,"SKODA",20,"OCTAVIA",4,"SEDAN"]
[null,null,null,null,null,null,null,null,null,null,null,null,null,null,null,"Actualizado Por: Gabriela Báez",null,null,null,null,null,null,null,null,null,null,null,"SKODA",20,"FAVORIT",5,"SEDAN"]
[null,null,null,null,null,null,null,null,null,null,null,null,null,null,null,"Fecha: 29/07/2024",null,null,null,null,null,null,null,null,null,null,null,"SKODA",20,"FORMAN",6,"SEDAN"]
[null,null,null,null,null,null,null,null,null,null,null,null,null,null,null,null,null,null,null,null,null,null,null,null,null,null,null,"SKODA",20,"SUPERB COMFORT",7,"SEDAN"]
[null,null,null,null,null,null,null,null,null,null,null,null,null,null,null,null,null,null,null,null,null,null,null,null,null,null,null,"SUBARU",58,"IMPREZA",1,"SEDAN"]
[null,null,null,null,null,null,null,null,null,null,null,null,null,null,null,null,null,null,null,null,null,null,null,null,null,null,null,"SUBARU",58,"LEGACY",2,"STATION WAGON"]
[null,null,null,null,null,null,null,null,null,null,null,null,null,null,null,null,null,null,null,null,null,null,null,null,null,null,null,"SUBARU",58,"GL10",3,"SEDAN"]
[null,null,null,null,null,null,null,null,null,null,null,null,null,null,null,null,null,null,null,null,null,null,null,null,null,null,null,"SUBARU",58,"A22L",4,"SEDAN"]
[null,null,null,null,null,null,null,null,null,null,null,null,null,null,null,null,null,null,null,null,null,null,null,null,null,null,null,"SUBARU",58,"FORESTER",5,"SEDAN"]
[null,null,null,null,null,null,null,null,null,null,null,null,null,null,null,null,null,null,null,null,null,null,null,null,null,null,null,"SUZUKI",60,"FORSA",11,"COUPE"]
[null,null,null,null,null,null,null,null,null,null,null,null,null,null,null,null,null,null,null,null,null,null,null,null,null,null,null,"SUZUKI",60,"GRAND VITARA",12,"JEEP"]
[null,null,null,null,null,null,null,null,null,null,null,null,null,null,null,null,null,null,null,null,null,null,null,null,null,null,null,"SUZUKI",60,"INTRUDER",13,"SEDAN"]
[null,null,null,null,null,null,null,null,null,null,null,null,null,null,null,null,null,null,null,null,null,null,null,null,null,null,null,"SUZUKI",60,"SAMURAI",16,"JEEP"]
[null,null,null,null,null,null,null,null,null,null,null,null,null,null,null,null,null,null,null,null,null,null,null,null,null,null,null,"SUZUKI",60,"SIDERICK",17,"JEEP"]
[null,null,null,null,null,null,null,null,null,null,null,null,null,null,null,null,null,null,null,null,null,null,null,null,null,null,null,"SUZUKI",60,"SJ 413",18,"JEEP"]
[null,null,null,null,null,null,null,null,null,null,null,null,null,null,null,null,null,null,null,null,null,null,null,null,null,null,null,"SUZUKI",60,"VITARA",22,"JEEP"]
[null,null,null,null,null,null,null,null,null,null,null,null,null,null,null,null,null,null,null,null,null,null,null,null,null,null,null,"SUZUKI",60,"LJ80",29,"JEEP"]
[null,null,null,null,null,null,null,null,null,null,null,null,null,null,null,null,null,null,null,null,null,null,null,null,null,null,null,"SUZUKI",60,"JIMNY 4X4",30,"JEEP"]
[null,null,null,null,null,null,null,null,null,null,null,null,null,null,null,null,null,null,null,null,null,null,null,null,null,null,null,"TALBOT",59,"ORIZONT",1,"SEDAN"]
[null,null,null,null,null,null,null,null,null,null,null,null,null,null,null,null,null,null,null,null,null,null,null,null,null,null,null,"TATA",75,"SAFARI",2,"JEEP"]
[null,null,null,null,null,null,null,null,null,null,null,null,null,null,null,null,null,null,null,null,null,null,null,null,null,null,null,"TATA",75,"INDICA",3,"SEDAN"]
[null,null,null,null,null,null,null,null,null,null,null,null,null,null,null,null,null,null,null,null,null,null,null,null,null,null,null,"TOYOTA",21,"TERCEL",1,"SEDAN"]
[null,null,null,null,null,null,null,null,null,null,null,null,null,null,null,null,null,null,null,null,null,null,null,null,null,null,null,"TOYOTA",21,"YARIS",2,"SEDAN"]
[null,null,null,null,null,null,null,null,null,null,null,null,null,null,null,null,null,null,null,null,null,null,null,null,null,null,null,"TOYOTA",21,"YARIS HATCHBACK 1.3",3,"STATION WAGON"]
[null,null,null,null,null,null,null,null,null,null,null,null,null,null,null,null,null,null,null,null,null,null,null,null,null,null,null,"TOYOTA",21,"COROLLA",4,"SEDAN"]
[null,null,null,null,null,null,null,null,null,null,null,null,null,null,null,null,null,null,null,null,null,null,null,null,null,null,null,"TOYOTA",21,"STOUT II",5,"PICK-UP"]
[null,null,null,null,null,null,null,null,null,null,null,null,null,null,null,null,null,null,null,null,null,null,null,null,null,null,null,"TOYOTA",21,"STOUT 2200 CHASIS",6,"PICK-UP"]
[null,null,null,null,null,null,null,null,null,null,null,null,null,null,null,null,null,null,null,null,null,null,null,null,null,null,null,"TOYOTA",21,"HILUX C/S 2.4 4X2",7,"PICK-UP"]
[null,null,null,null,null,null,null,null,null,null,null,null,null,null,null,null,null,null,null,null,null,null,null,null,null,null,null,"TOYOTA",21,"HILUX D/C 2.4 4X2",8,"PICK-UP"]
[null,null,null,null,null,null,null,null,null,null,null,null,null,null,null,null,null,null,null,null,null,null,null,null,null,null,null,"TOYOTA",21,"HILUX D/C 2.4 4X4",9,"PICK-UP"]
[null,null,null,null,null,null,null,null,null,null,null,null,null,null,null,null,null,null,null,null,null,null,null,null,null,null,null,"TOYOTA",21,"HILUX D/C 2.4 4X4 FULL",10,"PICK-UP"]
[null,null,null,null,null,null,null,null,null,null,null,null,null,null,null,null,null,null,null,null,null,null,null,null,null,null,null,"TOYOTA",21,"LAND CRUSIER 3P",11,"JEEP"]
[null,null,null,null,null,null,null,null,null,null,null,null,null,null,null,null,null,null,null,null,null,null,null,null,null,null,null,"TOYOTA",21,"LAND CRUSIER 5P",12,"JEEP"]
[null,null,null,null,null,null,null,null,null,null,null,null,null,null,null,null,null,null,null,null,null,null,null,null,null,null,null,"TOYOTA",21,"LAND CRUSIER PRADO 3P",13,"JEEP"]
[null,null,null,null,null,null,null,null,null,null,null,null,null,null,null,null,null,null,null,null,null,null,null,null,null,null,null,"TOYOTA",21,"LAND CRUSIER PRADO 5P",14,"JEEP"]
[null,null,null,null,null,null,null,null,null,null,null,null,null,null,null,null,null,null,null,null,null,null,null,null,null,null,null,"TOYOTA",21,"4 RUNNER",15,"JEEP"]
[null,null,null,null,null,null,null,null,null,null,null,null,null,null,null,null,null,null,null,null,null,null,null,null,null,null,null,"TOYOTA",21,"RAV4 3P",16,"JEEP"]
[null,null,null,null,null,null,null,null,null,null,null,null,null,null,null,null,null,null,null,null,null,null,null,null,null,null,null,"TOYOTA",21,"RAV4 5P",17,"JEEP"]
[null,null,null,null,null,null,null,null,null,null,null,null,null,null,null,null,null,null,null,null,null,null,null,null,null,null,null,"TOYOTA",21,"CAMRY",20,"SEDAN"]
[null,null,null,null,null,null,null,null,null,null,null,null,null,null,null,null,null,null,null,null,null,null,null,null,null,null,null,"TOYOTA",21,"CORONA",21,"SEDAN"]
[null,null,null,null,null,null,null,null,null,null,null,null,null,null,null,null,null,null,null,null,null,null,null,null,null,null,null,"TOYOTA",21,"CRESSIDA",22,"SEDAN"]
[null,null,null,null,null,null,null,null,null,null,null,null,null,null,null,null,null,null,null,null,null,null,null,null,null,null,null,"TOYOTA",21,"CROWN",23,"SEDAN"]
[null,null,null,null,null,null,null,null,null,null,null,null,null,null,null,null,null,null,null,null,null,null,null,null,null,null,null,"TOYOTA",21,"TACOMA",26,"STATION WAGON"]
[null,null,null,null,null,null,null,null,null,null,null,null,null,null,null,null,null,null,null,null,null,null,null,null,null,null,null,"TOYOTA",21,"STOUT C/S",27,"PICK-UP"]
[null,null,null,null,null,null,null,null,null,null,null,null,null,null,null,null,null,null,null,null,null,null,null,null,null,null,null,"TOYOTA",21,800,28,"PICK-UP"]
[null,null,null,null,null,null,null,null,null,null,null,null,null,null,null,null,null,null,null,null,null,null,null,null,null,null,null,"TOYOTA",21,"HILUX C/S 2.4 4X4",29,"PICK-UP"]
[null,null,null,null,null,null,null,null,null,null,null,null,null,null,null,null,null,null,null,null,null,null,null,null,null,null,null,"TOYOTA",21,"LAND CRUISER FZJ C/S",30,"PICK-UP"]
[null,null,null,null,null,null,null,null,null,null,null,null,null,null,null,null,null,null,null,null,null,null,null,null,null,null,null,"TOYOTA",21,"HIGHLANDER",32,"JEEP"]
[null,null,null,null,null,null,null,null,null,null,null,null,null,null,null,null,null,null,null,null,null,null,null,null,null,null,null,"TOYOTA",21,"1000 P/U",35,"PICK-UP"]
[null,null,null,null,null,null,null,null,null,null,null,null,null,null,null,null,null,null,null,null,null,null,null,null,null,null,null,"TOYOTA",21,"YARIS SPORT",36,"SEDAN"]
[null,null,null,null,null,null,null,null,null,null,null,null,null,null,null,null,null,null,null,null,null,null,null,null,null,null,null,"TOYOTA",21,"NITRO 3P",37,"COUPE"]
[null,null,null,null,null,null,null,null,null,null,null,null,null,null,null,null,null,null,null,null,null,null,null,null,null,null,null,"VOLKSWAGEN",22,"GOL 3P",1,"COUPE"]
[null,null,null,null,null,null,null,null,null,null,null,null,null,null,null,null,null,null,null,null,null,null,null,null,null,null,null,"VOLKSWAGEN",22,"GOL 5P",2,"SEDAN"]
[null,null,null,null,null,null,null,null,null,null,null,null,null,null,null,null,null,null,null,null,null,null,null,null,null,null,null,"VOLKSWAGEN",22,"GOL SPORT",3,"SEDAN"]
[null,null,null,null,null,null,null,null,null,null,null,null,null,null,null,null,null,null,null,null,null,null,null,null,null,null,null,"VOLKSWAGEN",22,"SAVEIRO",4,"PICK-UP"]
[null,null,null,null,null,null,null,null,null,null,null,null,null,null,null,null,null,null,null,null,null,null,null,null,null,null,null,"VOLKSWAGEN",22,"GOLF",5,"SEDAN"]
[null,null,null,null,null,null,null,null,null,null,null,null,null,null,null,null,null,null,null,null,null,null,null,null,null,null,null,"VOLKSWAGEN",22,"POLO HATCHBACK",6,"STATION WAGON"]
[null,null,null,null,null,null,null,null,null,null,null,null,null,null,null,null,null,null,null,null,null,null,null,null,null,null,null,"VOLKSWAGEN",22,"POLO",7,"SEDAN"]
[null,null,null,null,null,null,null,null,null,null,null,null,null,null,null,null,null,null,null,null,null,null,null,null,null,null,null,"VOLKSWAGEN",22,"JETTA 4P",8,"SEDAN"]
[null,null,null,null,null,null,null,null,null,null,null,null,null,null,null,null,null,null,null,null,null,null,null,null,null,null,null,"VOLKSWAGEN",22,"VENTO",9,"SEDAN"]
[null,null,null,null,null,null,null,null,null,null,null,null,null,null,null,null,null,null,null,null,null,null,null,null,null,null,null,"VOLKSWAGEN",22,"PARATI",10,"SEDAN"]
[null,null,null,null,null,null,null,null,null,null,null,null,null,null,null,null,null,null,null,null,null,null,null,null,null,null,null,"VOLKSWAGEN",22,"SANTANA 4P",11,"SEDAN"]
[null,null,null,null,null,null,null,null,null,null,null,null,null,null,null,null,null,null,null,null,null,null,null,null,null,null,null,"VOLKSWAGEN",22,"AMAZON",12,"SEDAN"]
[null,null,null,null,null,null,null,null,null,null,null,null,null,null,null,null,null,null,null,null,null,null,null,null,null,null,null,"VOLKSWAGEN",22,"BRASILIA",13,"SEDAN"]
[null,null,null,null,null,null,null,null,null,null,null,null,null,null,null,null,null,null,null,null,null,null,null,null,null,null,null,"VOLKSWAGEN",22,"ESCARABAJO",15,"COUPE"]
[null,null,null,null,null,null,null,null,null,null,null,null,null,null,null,null,null,null,null,null,null,null,null,null,null,null,null,"VOLKSWAGEN",22,"POLO SPORT",17,"SEDAN"]
[null,null,null,null,null,null,null,null,null,null,null,null,null,null,null,null,null,null,null,null,null,null,null,null,null,null,null,"VOLKSWAGEN",22,"QUAMTUM",18,"STATION WAGON"]
[null,null,null,null,null,null,null,null,null,null,null,null,null,null,null,null,null,null,null,null,null,null,null,null,null,null,null,"VOLKSWAGEN",22,"PASSAT",19,"SEDAN"]
[null,null,null,null,null,null,null,null,null,null,null,null,null,null,null,null,null,null,null,null,null,null,null,null,null,null,null,"VOLKSWAGEN",22,"GOLF GTI",20,"COUPE"]
[null,null,null,null,null,null,null,null,null,null,null,null,null,null,null,null,null,null,null,null,null,null,null,null,null,null,null,"VOLKSWAGEN",22,"BETTLE",21,"COUPE"]
[null,null,null,null,null,null,null,null,null,null,null,null,null,null,null,null,null,null,null,null,null,null,null,null,null,null,null,"VOLKSWAGEN",22,"BORA",22,"SEDAN"]
[null,null,null,null,null,null,null,null,null,null,null,null,null,null,null,null,null,null,null,null,null,null,null,null,null,null,null,"VOLKSWAGEN",22,"FOX SPORT",23,"SEDAN"]
[null,null,null,null,null,null,null,null,null,null,null,null,null,null,null,null,null,null,null,null,null,null,null,null,null,null,null,"VOLKSWAGEN",22,"FOX 2P",24,"COUPE"]
[null,null,null,null,null,null,null,null,null,null,null,null,null,null,null,null,null,null,null,null,null,null,null,null,null,null,null,"VOLKSWAGEN",22,"FOX 4P",25,"SEDAN"]
[null,null,null,null,null,null,null,null,null,null,null,null,null,null,null,null,null,null,null,null,null,null,null,null,null,null,null,"VOLVO",23,460,1,"SEDAN"]
[null,null,null,null,null,null,null,null,null,null,null,null,null,null,null,null,null,null,null,null,null,null,null,null,null,null,null,"VOLVO",23,"V70",2,"SEDAN"]
[null,null,null,null,null,null,null,null,null,null,null,null,null,null,null,null,null,null,null,null,null,null,null,null,null,null,null,"VOLVO",23,"S60",3,"SEDAN"]
[null,null,null,null,null,null,null,null,null,null,null,null,null,null,null,null,null,null,null,null,null,null,null,null,null,null,null,"VOLVO",23,240,4,"SEDAN"]
[null,null,null,null,null,null,null,null,null,null,null,null,null,null,null,null,null,null,null,null,null,null,null,null,null,null,null,"VOLVO",23,850,5,"SEDAN"]
[null,null,null,null,null,null,null,null,null,null,null,null,null,null,null,null,null,null,null,null,null,null,null,null,null,null,null,"VOLVO",23,240,6,"SEDAN"]
[null,null,null,null,null,null,null,null,null,null,null,null,null,null,null,null,null,null,null,null,null,null,null,null,null,null,null,"VOLVO",23,"122 S",7,"SEDAN"]
[null,null,null,null,null,null,null,null,null,null,null,null,null,null,null,null,null,null,null,null,null,null,null,null,null,null,null,"VOLVO",23,244,8,"SEDAN"]
[null,null,null,null,null,null,null,null,null,null,null,null,null,null,null,null,null,null,null,null,null,null,null,null,null,null,null,"VOLVO",23,"940 GL",9,"SEDAN"]
[null,null,null,null,null,null,null,null,null,null,null,null,null,null,null,null,null,null,null,null,null,null,null,null,null,null,null,"VOLVO",23,"430SE",10,"SEDAN"]
[null,null,null,null,null,null,null,null,null,null,null,null,null,null,null,null,null,null,null,null,null,null,null,null,null,null,null,"VOLVO",23,440,11,"SEDAN"]
[null,null,null,null,null,null,null,null,null,null,null,null,null,null,null,null,null,null,null,null,null,null,null,null,null,null,null,"VOLVO",23,740,12,"SEDAN"]
[null,null,null,null,null,null,null,null,null,null,null,null,null,null,null,null,null,null,null,null,null,null,null,null,null,null,null,"VOLVO",23,960,13,"SEDAN"]
[null,null,null,null,null,null,null,null,null,null,null,null,null,null,null,null,null,null,null,null,null,null,null,null,null,null,null,"VOLVO",23,760,14,"SEDAN"]
[null,null,null,null,null,null,null,null,null,null,null,null,null,null,null,null,null,null,null,null,null,null,null,null,null,null,null,"VOLVO",23,"S40",15,"SEDAN"]
[null,null,null,null,null,null,null,null,null,null,null,null,null,null,null,null,null,null,null,null,null,null,null,null,null,null,null,"VOLVO",23,"S80",16,"SEDAN"]
[null,null,null,null,null,null,null,null,null,null,null,null,null,null,null,null,null,null,null,null,null,null,null,null,null,null,null,"VOLVO",23,"S70",17,"SEDAN"]
[null,null,null,null,null,null,null,null,null,null,null,null,null,null,null,null,null,null,null,null,null,null,null,null,null,null,null,"VOLVO",23,"S90",19,"SEDAN"]
[null,null,null,null,null,null,null,null,null,null,null,null,null,null,null,null,null,null,null,null,null,null,null,null,null,null,null,"WORLDSTAR",99,"1300 CC",1,"PICK-UP"]
[null,null,null,null,null,null,null,null,null,null,null,null,null,null,null,null,null,null,null,null,null,null,null,null,null,null,null,"ZASTAVA",61,"SEDAN",1,"SEDAN"]
[null,null,null,null,null,null,null,null,null,null,null,null,null,null,null,null,null,null,null,null,null,null,null,null,null,null,null,"ZASTAVA",61,1100,2,"SEDAN"]

{"sheet":"DECLARACIÓN","index":7,"n_rows":36,"n_cols":27,"rows_kept":36,"cut":false,"hidden":false,"merged":[[35,0,35,31],[21,0,21,14],[21,15,21,23],[21,24,21,25],[21,26,21,32],[22,0,22,33],[24,0,24,33],[25,0,25,33],[27,0,27,13],[32,0,32,11],[33,0,33,26],[34,0,34,14],[19,0,19,4],[19,5,19,20],[19,24,19,27],[19,28,19,33],[20,0,20,9],[20,11,20,24],[20,25,20,33],[17,0,17,4],[17,5,17,20],[17,24,17,27],[17,28,17,33],[18,0,18,4],[18,5,18,20],[18,24,18,27],[18,28,18,33],[12,0,12,33],[14,0,14,1],[14,2,14,24],[14,25,14,33],[15,0,15,4],[15,5,15,18],[15,19,15,33],[9,0,9,33],[1,0,1,33],[3,0,3,8],[3,10,3,25],[7,0,7,33],[8,0,8,33]]}
[]
["DECLARACION"]
[]
[{"$f":"+FORM!F26","v":"GUAYAQUIL"},null,null,null,null,null,null,null,null,",",{"$f":"+FORM!F9","v":"2025-02-07"}]
[]
[]
[]
["Señores:"]
["BANCO DINERS CLUB DEL ECUADOR S.A."]
["Presente"]
[]
[]
["De mis consideraciones:"]
[]
["Yo,",null,{"$f":"FORM!Q38","v":"PRIMER NOMBRE SEGUNDO NOMBRE PRIMER APELLIDO SEGUNDO APELLIDO"},null,null,null,null,null,null,null,null,null,null,null,null,null,null,null,null,null,null,null,null,null,null,", portador de la cédula de "]
["ciudadanía No. ",null,null,null,null,{"$f":"+FORM!F40","v":"XXXXXXXXXX"},null,null,null,null,null,null,null,null,null,null,null,null,null,", declaro que el vehículo:"]
[]
["Marca:",null,null,null,null,{"$f":"+FORM!F78","v":"HYUNDAI"}]
["Modelo:",null,null,null,null,{"$f":"+FORM!F80","v":"ACCENT"}]
["Año:",null,null,null,null,{"$f":"+FORM!F87","v":"2022"}]
["Que he adquirido a la compañía:",null,null,null,null,null,null,null,null,null,null,{"$f":"+FORM!F14","v":"CONCESIONARIO"},null,null,null,null,null,null,null,null,null,null,null,null,null,"mediante contrato de "]
["adhesión al fideicomiso, suscrito con fecha: ",null,null,null,null,null,null,null,null,null,null,null,null,null,null,{"$f":"+K4","v":"2025-02-07"},null,null,null,null,null,null,null,null,{"$f":"CONCATENATE(\",\",\" \",+FORM!F60)","v":", Si"},null,"es de único uso "]
["personal o familiar."]
[]
["Declaro asimismo que la información aquí consignada es veraz y exacta, sobre lo cual asumo toda la respon-"]
["sabilidad que fuere del caso."]
[]
["Atentamente, "]
[]
[]
[]
[]
[]
[{"$f":"+C15","v":"PRIMER NOMBRE SEGUNDO NOMBRE PRIMER APELLIDO SEGUNDO APELLIDO"}]
["No. CEDULA"]
[{"$f":"+FORM!F40","v":"XXXXXXXXXX"}]

{"sheet":"AUT. CARGO","index":8,"n_rows":35,"n_cols":29,"rows_kept":35,"cut":false,"hidden":false,"merged":[[33,0,33,14],[31,0,31,11],[26,0,26,13],[32,0,32,26],[34,0,34,31],[14,2,14,24],[14,25,14,34],[14,0,14,1],[3,10,3,25],[12,0,12,34],[1,0,1,34],[7,0,7,34],[8,0,8,34],[9,0,9,34],[3,0,3,8],[21,0,21,34],[16,0,16,23],[16,24,16,27],[16,28,16,33],[15,0,15,12],[15,13,15,18],[15,19,15,34],[19,10,19,20],[17,0,17,34]]}
[]
["AUTORIZACIÓN DE CARGO"]
[]
[{"$f":"+FORM!F26","v":"GUAYAQUIL"},null,null,null,null,null,null,null,null,",",{"$f":"+FORM!F9","v":"2025-02-07"}]
[]
[]
[]
["Señores:"]
["BANCO DINERS CLUB DEL ECUADOR S.A."]
["Presente"]
[]
[]
["De mis consideraciones:"]
[]
["Yo,",null,{"$f":"FORM!Q38","v":"PRIMER NOMBRE SEGUNDO NOMBRE PRIMER APELLIDO SEGUNDO APELLIDO"},null,null,null,null,null,null,null,null,null,null,null,null,null,null,null,null,null,null,null,null,null,null,", en  calidad  de  titular principal "]
["de la tarjeta de crédito Diners Club No. ",null,null,null,null,null,null,null,null,null,null,null,null,{"$f":"FORM!F147","v":"XXXXXXXXXX1234"},null,null,null,null,null,", autorizo  libre  y  voluntariamente a BANCO DINERS"]
["CLUB DEL ECUADOR S.A., se cargue a mi señalada tarjeta el valor de US$",null,null,null,null,null,null,null,null,null,null,null,null,null,null,null,null,null,null,null,null,null,null,null,{"$f":"+FORM!$F$133","v":527.71499999999992},null,null,null,"que corresponde"]
["al costo de gastos notariales y costo  de adhesión al fideicomiso, valor que me  comprometo a cancelar de manera incondicional en la siguiente forma:"]
[]
[null,null,null,null,null,null,null,null,null,"X",{"$f":"+FORM!F135","v":"CORRIENTE"}]
[]
["Expresamente me obligo a  no  revocar  la  presente autorización, y a la vez libero de toda responsabilidad a BANCO DINERS CLUB  DEL  ECUADOR  S.A. por los cargos efectuados en base a la presente autorización. De igual manera autorizo que en caso de pérdida,  hurto,  robo o cualquier otra circunstancia, que merezca ser cambiado mi actual número de tarjeta,   se cuente con el nuevo que se me asigne para cancelar todos mis consumos de manera incondicional,  de tal forma que mis obligaciones no  queden en mora por los conceptos antes mencionados y hasta su total cancelación."]
[]
[]
[]
[]
["Atentamente, "]
[]
[]
[]
[]
[]
[{"$f":"+C15","v":"PRIMER NOMBRE SEGUNDO NOMBRE PRIMER APELLIDO SEGUNDO APELLIDO"}]
["No. CEDULA"]
[{"$f":"+FORM!F40","v":"XXXXXXXXXX"}]

{"sheet":"TABLA AMORT.","index":9,"n_rows":92,"n_cols":26,"rows_kept":92,"cut":false,"hidden":false,"merged":[[0,0,0,6],[4,0,5,6],[6,0,6,1],[6,3,6,4],[6,5,6,6],[1,0,1,6],[2,0,2,6],[3,0,3,6],[9,0,9,1],[9,3,9,4],[9,5,9,6],[7,0,7,1],[7,3,7,4],[7,5,7,6],[8,0,8,1],[8,5,8,6],[8,3,8,4],[88,5,88,6],[89,1,89,2],[89,5,89,6],[88,1,88,3],[17,0,17,6],[86,1,86,2],[86,4,86,5]]}
["FINANCIAMIENTO DE  VEHÍCULOS - Tabla de amortización",null,null,null,null,null,null,null,null,null,null,null,null,null,null,null,null,null,null,null,null,null,null,null,364171,1]
["Tabla simple de amortizaciones que cubre n períodos de pago de un préstamo.",null,null,null,null,null,null,null,null,null,null,null,null,null,null,null,null,null,null,null,null,null,null,null,365166,1]
["1) Para usar la tabla, simplemente cambie cualquiera de los valores en el área \"Datos iniciales\".",null,null,null,null,null,null,null,null,null,null,null,null,null,null,null,null,null,null,null,null,null,null,null,365167,1]
["2) Para imprimir la tabla, elija Imprimir en el menú Archivo. El área de impresión ya está definida.",null,null,null,null,null,null,null,null,null,null,null,null,null,null,null,null,null,null,null,null,null,null,null,365169,1]
["Datos iniciales",null,null,null,null,null,null,null,null,null,null,null,null,null,null,null,null,null,null,null,null,null,null,null,365181,1]
[null,null,null,null,null,null,null,null,null,null,null,null,null,null,null,null,null,null,null,null,null,null,null,null,365420,1]
["Monto:",null,{"$f":"+FORM!F101-FORM!F103","v":10000},"Nombre del Cliente:",null,{"$f":"CONCATENATE(FORM!Q36,\" \",FORM!Q34)","v":"PRIMER NOMBRE SEGUNDO NOMBRE PRIMER APELLIDO SEGUNDO APELLIDO"},null,null,null,null,null,null,null,null,null,null,null,null,null,null,null,null,null,null,365422,1]
["Tasa de interés anual:",null,{"$f":"+FORM!F107","v":0.156},"Cédula de Identidad:",null,{"$f":"+FORM!F40","v":"XXXXXXXXXX"},null,null,null,null,null,null,null,null,null,null,null,null,null,null,null,null,null,null,365425,1]
["Plazo, en años:",null,{"$f":"+FORM!F105/12","v":2},"Fecha del crédito:",null,{"$f":"+FORM!F9","v":"2025-02-07"},null,null,null,null,null,null,null,null,null,null,null,null,null,null,null,null,null,null,365427,1]
["Pagos por año:",null,12,"Vencimiento primer pago:",null,{"$f":"+F9+30","v":"2025-03-09"},null,null,null,null,null,null,null,null,null,null,null,null,null,null,null,null,null,null,365428,1]
[null,null,null,null,null,null,null,null,null,null,null,null,null,null,1,null,null,null,null,null,null,null,null,null,365023,1]
[null,null,null,null,null,null,null,null,null,null,null,null,null,null,1.5,null,null,null,null,null,null,null,null,null,365025,1]
[null,null,null,null,null,null,null,null,null,null,null,null,null,null,2,null,null,null,null,null,null,null,null,null,365026,1]
[null,"CUOTA MENSUAL",{"$f":"PMT(ROUNDDOWN((Tasa_interés_anual/360*365),4)/12,Plazo_en_años*Pagos_por_año,-Monto_préstamo)","v":488.72375364369611},null,"NUMERO DE CUOTAS:",{"$f":"Pagos_por_año*Plazo_en_años","v":24},null,null,{"$f":"+Pago_calculado*Pagos_por_año","v":5864.6850437243538},null,null,null,null,null,3,null,null,null,null,null,null,null,null,null,364173,1]
[null,null,null,null,null,null,null,null,null,null,null,null,null,null,null,null,null,null,null,null,null,null,null,null,362620,1]
[null,"Usar el pago:",{"$f":"(IF(Pago_introducido=0,Pago_calculado,Pago_introducido))","v":488.72375364369611},null,null,{"$f":"\"Saldo inicial antes del pago: \"&TEXT(Núm_primer_pago,\"0\")&\":\"","v":"Saldo inicial antes del pago: 1:"},{"$f":"FV(Tasa_interés_anual/Pagos_por_año,Núm_primer_pago-1,Pago_a_usar,-Monto_préstamo)","v":10000},null,{"$f":"SUM(Saldo_inicial_tabla+G44)","v":11729.370087448708},null,{"$f":"+Pago_a_usar*Pagos_por_año*Plazo_en_años","v":11729.370087448708},null,null,null,null,null,null,null,null,null,null,null,null,null,362621,1]
[null,"Primer pago en la tabla:",1,null,null,{"$f":"\"Interés acumulado antes del pago: \"&TEXT(Núm_primer_pago,\"0\")&\":\"","v":"Interés acumulado antes del pago: 1:"},{"$f":"Pago_a_usar*(Núm_primer_pago-1)-(Monto_préstamo-Saldo_inicial_tabla)","v":0},null,null,null,{"$f":"+K16-Saldo_inicial_tabla","v":1729.3700874487076},null,null,null,"15 de c/mes",null,null,null,null,null,null,null,null,null,362062,1]
["Tabla",null,null,null,null,null,null,null,null,null,null,null,null,null,"30 de c/mes",null,null,null,null,null,null,null,null,null,364444,1]
[null,"Fecha de","Saldo",null,null,"Saldo","Interés",null,null,null,null,null,null,null,{"$f":"+B21-$F$9","v":30},{"$f":"+B21-F9","v":30},null,null,null,null,null,null,null,null,361349,1]
["Nº","Pago*","inicial","Interés","Capital","final","acumulado",null,null,null,null,null,null,null,30,30,null,null,null,null,null,null,null,null,364700,1]
[{"$f":"IF(Núm_primer_pago<Total_de_pagos,Núm_primer_pago,\"\")","v":1},{"$f":"Mostrar.fecha","v":"2025-03-09"},{"$f":"IF(A21<>\"\",IF(Saldo_inicial_tabla<0,0,Saldo_inicial_tabla),\"\")","v":10000},{"$f":"Interés","v":131.75},{"$f":"Capital","v":356.97375364369611},{"$f":"Saldo.final","v":9643.0262463563031},{"$f":"IF(A21<>\"\",D21+Interés_previo_tabla,\"\")","v":131.75},null,{"$f":"+Pago_a_usar*25000","v":12218093.841092402},null,null,null,null,null,{"$f":"+O20-O19","v":0},{"$f":"+P20-P19","v":0},null,null,null,null,null,null,null,null,364703,1]
[{"$f":"Núm.pago","v":2},{"$f":"Mostrar.fecha","v":"2025-04-09"},{"$f":"Saldo.inicial","v":9643.0262463563031},{"$f":"Interés","v":127.04687079574428},{"$f":"Capital","v":361.67688284795184},{"$f":"Saldo.final","v":9281.3493635083505},{"$f":"Interés.acumulado","v":258.79687079574427},null,null,null,"ene",2001,null,null,{"$f":"+Monto_préstamo","v":10000},{"$f":"Monto_préstamo","v":10000},null,null,null,null,null,null,null,null,364717,1]
[{"$f":"Núm.pago","v":3},"2025-05-09",{"$f":"Saldo.inicial","v":9281.3493635083505},{"$f":"Interés","v":122.28177786422252},{"$f":"Capital","v":366.44197577947358},8914.9073877288774,{"$f":"Interés.acumulado","v":381.0786486599668},null,null,null,"feb",null,null,null,{"$f":"+Tasa_interés_anual","v":0.156},{"$f":"Tasa_interés_anual","v":0.156},null,null,null,null,null,null,null,null,364716,1]
[4,"2025-06-09",{"$f":"Saldo.inicial","v":8914.9073877288774},{"$f":"Interés","v":117.45390483332795},371.26984881036816,8543.6375389185087,498.53255349329476,null,null,null,"mar",null,null,null,360,360,null,null,null,null,null,null,null,null,360138,1]
[5,"2025-07-09",8543.6375389185087,{"$f":"Interés","v":112.56242457525134},376.16132906844479,8167.4762098500642,611.09497806854608,null,null,null,"abr",null,null,null,null,null,null,null,null,null,null,null,null,null,360218,1]
[6,"2025-08-09",8167.4762098500642,{"$f":"Interés","v":107.6064990647746},381.11725457892152,7786.3589552711428,718.70147713332062,null,null,null,"abr",null,null,null,null,null,null,null,null,null,null,null,null,null,360219,1]
[7,"2025-09-09",7786.3589552711428,{"$f":"Interés","v":102.58527923569731},386.13847440799879,7400.2204808631441,821.28675636901789,null,null,null,"may",null,null,null,null,null,null,null,null,null,null,null,null,null,364170,16]
[8,"2025-10-09",7400.2204808631441,{"$f":"Interés","v":97.497904835371912},391.2258488083242,7008.9946320548197,918.78466120438975,null,null,null,"jun",null,null,null,null,null,null,null,null,null,null,null,null,null,364234,16]
[9,"2025-11-09",7008.9946320548197,{"$f":"Interés","v":92.343504277322253},396.38024936637385,6612.6143826884454,1011.128165481712,null,null,null,"jul",null,null,null,null,null,null,null,null,null,null,null,null,null,365147,16]
[10,"2025-12-09",6612.6143826884454,{"$f":"Interés","v":87.121194491920264},401.60255915177584,6211.0118235366699,1098.2493599736322,null,null,null,"jul",null,null,null,null,null,null,null,null,null,null,null,null,null,365168,16]
[11,"2026-01-09",6211.0118235366699,{"$f":"Interés","v":81.830080775095624},406.8936728686005,5804.1181506680696,1180.0794407487278,null,null,null,"ago",null,null,null,null,null,null,null,null,null,null,null,null,null,365421,16]
[12,"2026-02-09",5804.1181506680696,{"$f":"Interés","v":76.469256635051821},412.25449700864431,5391.8636536594249,1256.5486973837797,null,null,null,"sep",null,null,null,null,null,null,null,null,null,null,null,null,null,365423,16]
[13,"2026-03-09",5391.8636536594249,{"$f":"Interés","v":71.03780363696292},417.68595000673321,4974.1777036526919,1327.5865010207426,null,null,null,"oct",null,null,null,null,null,null,null,null,null,null,null,null,null,365424,16]
[14,"2026-04-09",4974.1777036526919,{"$f":"Interés","v":65.53479124562422},423.18896239807191,4550.9887412546195,1393.1212922663669,null,null,null,"nov",null,null,null,null,null,null,null,null,null,null,null,null,null,365429,16]
[15,"2026-05-09",4550.9887412546195,{"$f":"Interés","v":59.959276666029609},428.7644769776665,4122.2242642769534,1453.0805689323965,null,null,null,"dic",null,null,null,null,null,null,null,null,null,null,null,null,null,365453,16]
[16,"2026-06-09",4122.2242642769534,{"$f":"Interés","v":54.310304681848855},434.41344896184728,3687.8108153151061,1507.3908736142455,null,null,null,"dic",null,null,null,null,null,null,null,null,null,null,null,null,null,365454,16]
[17,"2026-07-09",3687.8108153151061,{"$f":"Interés","v":48.586907491776522},440.1368461519196,3247.6739691631865,1555.9777811060221,null,null,null,"ene",2002,null,null,null,null,null,null,null,null,null,null,null,null,365001,16]
[18,"2026-08-09",3247.6739691631865,{"$f":"Interés","v":42.788104543724984},445.9356490999711,2801.7383200632153,1598.7658856497471,null,null,null,"ene",null,null,null,null,null,null,null,null,null,null,null,null,null,365256,16]
[19,"2026-09-09",2801.7383200632153,{"$f":"Interés","v":36.91290236683286},451.81085127686327,2349.9274687863522,1635.67878801658,null,null,null,"feb",null,null,null,null,null,null,null,null,null,null,null,null,null,364172,16]
[20,"2026-10-09",2349.9274687863522,{"$f":"Interés","v":30.960294401260189},457.76345924243594,1892.1640095439161,1666.6390824178402,null,null,null,"mar",null,null,null,null,null,null,null,null,null,null,null,null,null,364261,16]
[21,"2026-11-09",1892.1640095439161,{"$f":"Interés","v":24.929260825741093},463.79449281795502,1428.3695167259611,1691.5683432435812,null,null,null,"abr",null,null,null,null,null,null,null,null,null,null,null,null,null,363999,16]
[22,"2026-12-09",1428.3695167259611,{"$f":"Interés","v":18.818768382864537},469.90498526083155,958.46453146512954,1710.3871116264459,null,null,null,"abr",null,null,null,null,null,null,null,null,null,null,null,null,null,362622,16]
[23,"2027-01-09",958.46453146512954,{"$f":"Interés","v":12.62777020205308},476.09598344164306,482.36854802348648,1723.014881828499,null,null,null,"may",null,null,null,null,null,null,null,null,null,null,null,null,null,361329,16]
[24,"2027-02-09",482.36854802348648,{"$f":"Interés","v":6.3552056202094347},482.36854802348648,0,1729.3700874487085,null,null,null,"jun",null,null,null,null,null,null,null,null,null,null,null,null,null,364701,16]
["","","",{"$f":"Interés","v":""},"","","",null,null,null,"jul",null,null,null,null,null,null,null,null,null,null,null,null,null,364702,16]
["","","",{"$f":"Interés","v":""},"","","",null,null,null,"jul",null,null,null,null,null,null,null,null,null,null,null,null,null,364719,16]
["","","",{"$f":"Interés","v":""},"","","",null,null,null,"ago",null,null,null,null,null,null,null,null,null,null,null,null,null,364190,16]
["","","",{"$f":"Interés","v":""},"","","",null,null,null,"sep",null,null,null,null,null,null,null,null,null,null,null,null,null,364522,16]
["","","",{"$f":"Interés","v":""},"","","",null,null,null,"oct",null,null,null,null,null,null,null,null,null,null,null,null,null,360041,16]
["","","",{"$f":"Interés","v":""},"","","",null,null,null,"nov",null,null,null,null,null,null,null,null,null,null,null,null,null,361868,16]
["","","",{"$f":"Interés","v":""},"","","",null,null,null,"dic"]
["","","",{"$f":"Interés","v":""},"","","",null,null,null,"dic"]
["","","",{"$f":"Interés","v":""},"","","",null,null,null,"ene",2003]
["","","",{"$f":"Interés","v":""},"","","",null,null,null,"ene"]
["","","",{"$f":"Interés","v":""},"","","",null,null,null,"feb"]
["","","",{"$f":"Interés","v":""},"","","",null,null,null,"mar"]
["","","",{"$f":"Interés","v":""},"","",""]
["","","",{"$f":"Interés","v":""},"","",""]
["","","",{"$f":"Interés","v":""},"","",""]
["","","",{"$f":"Interés","v":""},"","",""]
["","","",{"$f":"Interés","v":""},"","",""]
["","","",{"$f":"Interés","v":""},"","",""]
["","","",{"$f":"Interés","v":""},"","",""]
["","","",{"$f":"Interés","v":""},"","",""]
["","","",{"$f":"Interés","v":""},"","",""]
["","","",{"$f":"Interés","v":""},"","",""]
["","","",{"$f":"Interés","v":""},"","",""]
["","","",{"$f":"Interés","v":""},"","",""]
["","","",{"$f":"Interés","v":""},"","",""]
["","","",{"$f":"Interés","v":""},"","",""]
["","","",{"$f":"Interés","v":""},"","",""]
["","","",{"$f":"Interés","v":""},"","",""]
["","","",{"$f":"Interés","v":""},"","",""]
["","","",{"$f":"Interés","v":""},"","",""]
["","","",{"$f":"Interés","v":""},"","",""]
["","","",{"$f":"Interés","v":""},"","",""]
["","","",{"$f":"Interés","v":""},"","",""]
["","","",{"$f":"Interés","v":""},"","",""]
["","","",{"$f":"Interés","v":""},"","",""]
["","","",{"$f":"Interés","v":""},"","",""]
[]
[]
[]
[]
[]
[]
[null,"FIRMA CLIENTE",null,null,"FIRMA CÓNYUGE"]
[]
["Nombre:",{"$f":"+F7","v":"PRIMER NOMBRE SEGUNDO NOMBRE PRIMER APELLIDO SEGUNDO APELLIDO"},null,null,"Nombre:",{"$f":"IF(FORM!F64=0,\"\",CONCATENATE(FORM!Q66,\" \",FORM!Q64,\" \"))","v":""}]
["C.C.:",{"$f":"+FORM!F40","v":"XXXXXXXXXX"},null,null,"C.C.:",{"$f":"IF(FORM!F64=0,\"\",FORM!F68)","v":""},null,null,null,null,"sep"]
[]
[null,"* Fecha a ser facturada en su estado de cuenta de la Tarjeta Diners Club."]

{"sheet":"COM VEND","index":10,"n_rows":32,"n_cols":2,"rows_kept":32,"cut":false,"hidden":true,"merged":[[31,0,31,1],[11,0,11,1],[17,0,30,0],[12,0,16,0]]}
[null,"FORMULARIO DE COMISIÓN PARA VENDEDORES"]
["Tipo de Compra","VEHÍCULO NUEVO"]
["Fecha de Compra",{"$f":"+FORM!F9","v":"2025-02-07"}]
["Nombre del Vendedor",{"$f":"+FORM!F28","v":"NOMBRE Y APELLIDO"}]
["Cédula de Identidad del Vendedor",{"$f":"+FORM!F30","v":"XXXXXXXXXX"}]
["Concesionario",{"$f":"+FORM!F14","v":"CONCESIONARIO"}]
["Ciudad",{"$f":"+FORM!F26","v":"GUAYAQUIL"}]
["Nro. de tarjeta del socio",{"$f":"CONCATENATE(FORM!F151,FORM!L151)","v":"3608601234567890"}]
["Nombre del Socio",{"$f":"FORM!Q38","v":"PRIMER NOMBRE SEGUNDO NOMBRE PRIMER APELLIDO SEGUNDO APELLIDO"}]
["Valor del Vale",{"$f":"+PAGARE!D5","v":11729.370087448708}]
["Plazo",{"$f":"+FORM!F105*12","v":288}]
["CHECK LIST DE DOCUMENTOS (Confirme que esté enviando completa la documentación)"]
["Documentos para entregar al Socio","Carta AIG"]
[null,"Certificado de Cobertura Provisional"]
[null,"Certificado de Seguro Colectivo Vida Deudores"]
[null,"1 Solicitud - Certificado Seguro de Desgravamen"]
[null,"Orden de instalación de dispositivos de rastreo (si aplica)"]
["Documentos para entregar Diners Club","4 Contrato de Adhesión al Fideicomiso"]
[null,"4 Reconocimiento de Firmas"]
[null,"1 Formulario Conozca su Cliente FDV"]
[null,"1 Formulario Autocertificación FDV"]
[null,"1 Pagaré"]
[null,"1 Declaración Unico Vehículo  Uso familiar."]
[null,"3 Autorización de Cargo "]
[null,"4 Tabla de Amortización"]
[null,"Solicitud de Seguro Vehículo"]
[null,"3 Fiel Copia de la Factura del Vehículo"]
[null,"3 Copia de Cédula del Socio"]
[null,"3 Copia de Cédula del Cónyuge"]
[null,"Voucher lleno con el número de autorización y Recap."]
[null,"Formulario de dispositivo de rastreo (si aplica)"]
["POR FAVOR ADJUNTE ESTE FORMULARIO A LOS CONTRATOS Y DEMÁS DOCUMENTOS QUE REMITE A DINERS CLUB."]

{"sheet":"PAGARE","index":11,"n_rows":51,"n_cols":26,"rows_kept":51,"cut":false,"hidden":false,"merged":[[1,0,1,25],[2,0,2,25],[4,3,4,8],[6,0,6,25],[7,4,7,8],[7,21,7,25],[13,0,13,25],[16,0,16,25],[15,0,15,25],[18,0,18,25],[8,23,8,25],[9,13,9,15],[10,15,10,19],[10,22,10,24],[11,19,11,20],[11,13,11,16],[33,4,33,12],[33,14,33,25],[32,4,32,12],[20,0,20,25],[24,0,24,25],[22,0,22,25],[32,14,32,25],[21,1,21,4],[26,11,26,16],[48,4,48,12],[48,14,48,25],[42,12,42,19],[47,4,47,12],[47,14,47,25],[42,7,42,11]]}
[]
["PAGARE A LA ORDEN"]
["(Con vencimientos sucesivos)"]
[]
["POR: USD$",null,null,{"$f":"(X9*N10)","v":11729.370087448708}]
[]
["Debo (emos) y pagaré (mos) solidaria e incondicionalmente a la orden de BANCO DINERS CLUB DEL ECUADOR S.A.,"]
["en la ciudad de",null,null,null,{"$f":"+H27","v":"GUAYAQUIL"},null,null,null,null,",o en el lugar donde me(nos) reconvenga, la cantidad de",null,null,null,null,null,null,null,null,null,null,null,{"$f":"+D5","v":11729.370087448708}]
["DOLARES DE LOS ESTADOS UNIDOS DE AMERICA obligándome(nos) a pagar irrevocablemente",null,null,null,null,null,null,null,null,null,null,null,null,null,null,null,null,null,null,null,null,"en",null,{"$f":"+FORM!F105","v":24}]
["cuotas mensuales cuotas mensuales iguales y sucesivas de US$",null,null,null,null,null,null,null,null,null,null,null,null,{"$f":"+'TABLA AMORT.'!C16","v":488.72375364369611},null,null,"DOLARES DE LOS ESTADOS"]
["UNIDOS DE AMERICA, cada una, y que serán pagadas a partir del ",null,null,null,null,null,null,null,null,null,null,null,null,{"$f":"+DAY('TABLA AMORT.'!F10)","v":9},"de",{"$f":"+'TABLA AMORT.'!F10","v":"2025-03-09"},null,null,null,null,"del",null,{"$f":"+P11","v":"2025-03-09"},null,null,"y asi"]
["sucesivamente hasta su pago total, esto es hasta el",null,null,null,null,null,null,null,null,null,null,{"$f":"IF(FORM!F105/12=1,'TABLA AMORT.'!B32)+IF(FORM!F105/12=2,'TABLA AMORT.'!B44)+IF(FORM!F105/12=3,'TABLA AMORT.'!B56)+IF(FORM!F105/12=4,'TABLA AMORT.'!B68)+IF(FORM!F105/12=5,'TABLA AMORT.'!B80)","v":"2027-02-09"},"de ",{"$f":"+L12","v":"2027-02-09"},null,null,null,"del ",null,{"$f":"+N12","v":"2027-02-09"},null,"."]
[]
["Declaro(amos) que la falta de pago oportuno de cualquiera de las cuotas mensuales  antes detalladas o de parte de alguna de ellas, permitirá al Acreedor anticipar y declarar de plazo vencido las cuotas posteriores y exigir al(los) Deudor(es) y/o Aval(es) el pago total de la obligación contenida en este pagaré, más los gastos y costas a que hubiere lugar."]
[]
["En caso de mora, pagaré (mos) desde su vencimiento hasta su total cancelación, sobre los valores no pagados, la máxima tasa de interés de mora que para el efecto haya dispuesto la Autoridad Monetaria correspondiente, vigentes a la respectiva fecha de vencimiento."]
["Además, pagaré (mos)  todos los gastos judiciales, extra judiciales, y honorarios profesionales que ocasione el cobro, bastando para determinar el monto de tales gastos, la sola aseveración del Acreedor."]
[]
["Se deja constancia que BANCO DINERS CLUB DEL ECUADOR S.A a su sola decisión podrá ceder todos los derechos emanados de este Pagaré a la Orden a cualquier persona natural y/o jurídica, por los que el (la/los) suscriptor (es) desde ya acepta (n) la pertinente cesión de derechos, incluso se da(n) por notificado(s) del traspaso del crédito. En tal virtud, la o las cesiones que se realicen, surtirán pleno efecto respecto al deudor (es),  sus avalistas solidarios y respecto de terceros."]
[]
["Renuncio (amos) fuero y domicilio y quedo (amos) expresamente sometido (s) a los jueces competentes de la ciudad"]
["de ",{"$f":"+E8","v":"GUAYAQUIL"},null,null,null,"o  del  lugar  en  que  se  nos  reconvenga, y al trámite legal correspondiente, a elección del "]
["demandante; obligándome (nos) irrevocablemente al fiel cumplimiento de lo aquí estipulado con todos mis (nuestros) bienes  presentes y futuros. El pago no podrá hacerse por partes ni aún por mis (nuestros) herederos."]
[]
["Sin protesto. Exímese al Acreedor de este Pagaré a la Orden, de su presentación para el pago al (los) suscriptor(es) del mismo, así como realizar los avisos por falta de pago."]
[]
["Lugar y Fecha de suscripción:",null,null,null,null,null,null,{"$f":"+FORM!F48","v":"GUAYAQUIL"},null,null,null,{"$f":"+'TABLA AMORT.'!F9","v":"2025-02-07"}]
[]
[]
[]
[]
["f) ",null,null,null,null,null,null,null,null,null,null,null,null,null,"f) "]
["NOMBRES:",null,null,null,{"$f":"CONCATENATE(FORM!Q36,\" \",FORM!Q34)","v":"PRIMER NOMBRE SEGUNDO NOMBRE PRIMER APELLIDO SEGUNDO APELLIDO"},null,null,null,null,null,null,null,null,null,{"$f":"IF(FORM!F64=0,\"\",CONCATENATE(FORM!Q66,\" \",FORM!Q64))","v":""}]
["Dirección:",null,null,null,{"$f":"FORM!F46","v":"CARCELEN"},null,null,null,null,null,null,null,null,null,{"$f":"IF(FORM!F64=0,\"\",PAGARE!E34)","v":""}]
["RUC o CC",null,null,null,{"$f":"FORM!F40","v":"XXXXXXXXXX"},null,null,null,null,null,null,null,null,null,{"$f":"IF(FORM!F64=0,\"\",FORM!F68)","v":""}]
["Teléfono:",null,null,null,{"$f":"+FORM!F38","v":"CELULAR"},null,null,null,null,null,null,null,null,null,{"$f":"IF(FORM!F64=0,\"\",PAGARE!E36)","v":""}]
[]
[]
[]
[]
["VISTO BUENO"]
[]
["Lugar y Fecha de suscripción:",null,null,null,null,null,null,{"$f":"+H27","v":"GUAYAQUIL"},null,null,null,null,{"$f":"+L27","v":"2025-02-07"}]
[]
[]
[]
["f) ",null,null,null,null,null,null,null,null,null,null,null,null,null,"f) "]
["NOMBRES:",null,null,null,{"$f":"+E33","v":"PRIMER NOMBRE SEGUNDO NOMBRE PRIMER APELLIDO SEGUNDO APELLIDO"},null,null,null,null,null,null,null,null,null,{"$f":"+O33","v":""}]
["Dirección:",null,null,null,{"$f":"+E34","v":"CARCELEN"},null,null,null,null,null,null,null,null,null,{"$f":"+O34","v":""}]
["RUC o CC",null,null,null,{"$f":"+E35","v":"XXXXXXXXXX"},null,null,null,null,null,null,null,null,null,{"$f":"+O35","v":""}]
["Teléfono:",null,null,null,{"$f":"+E36","v":"CELULAR"},null,null,null,null,null,null,null,null,null,{"$f":"+O36","v":""}]

{"sheet":"RASTREO SATELITAL","index":12,"n_rows":64,"n_cols":246,"rows_kept":64,"cut":false,"hidden":false,"merged":[[8,0,8,4],[8,5,8,31],[9,0,9,4],[9,5,9,31],[10,0,10,4],[10,5,10,16],[10,17,10,20],[10,21,10,31],[0,0,0,31],[4,0,5,31],[6,0,6,31],[7,0,7,4],[7,5,7,14],[7,15,7,21],[7,22,7,31],[15,0,15,2],[15,3,15,8],[15,9,15,12],[15,13,15,18],[15,19,15,21],[15,22,15,31],[11,0,11,6],[11,7,11,31],[12,3,12,30],[13,0,13,31],[14,0,14,2],[14,3,14,8],[14,9,14,12],[14,13,14,18],[14,19,14,21],[14,22,14,31],[17,0,19,31],[23,5,23,9],[23,21,23,25],[25,0,25,31],[26,0,26,10],[26,12,26,31],[16,0,16,2],[16,3,16,8],[16,9,16,12],[16,13,16,18],[16,19,16,21],[16,22,16,31],[34,64,34,95],[35,0,35,31],[35,64,35,95],[28,45,28,51],[28,52,28,63],[28,0,28,13],[28,14,28,19],[28,20,28,31],[28,77,28,83],[28,84,28,95],[29,0,29,31],[31,45,31,47],[31,48,31,50],[31,51,31,52],[31,53,31,63],[31,64,31,76],[31,77,31,79],[28,64,28,76],[31,115,31,116],[31,80,31,82],[31,83,31,84],[31,85,31,95],[31,96,31,108],[31,109,31,111],[28,192,28,204],[31,117,31,127],[31,128,31,140],[31,141,31,143],[31,144,31,146],[31,147,31,148],[28,160,28,172],[28,148,28,159],[31,160,31,172],[28,96,28,108],[28,141,28,147],[28,109,28,115],[28,116,28,127],[28,128,28,140],[31,243,31,244],[28,244,28,255],[28,224,28,236],[28,180,28,191],[28,173,28,179],[31,245,31,255],[28,237,28,243],[28,205,28,211],[28,212,28,223],[31,192,31,204],[31,205,31,207],[31,213,31,223],[31,224,31,236],[31,208,31,210],[31,211,31,212],[36,64,36,78],[34,224,34,255],[31,237,31,239],[35,96,35,127],[31,240,31,242],[31,173,31,175],[31,176,31,178],[31,179,31,180],[31,181,31,191],[36,224,36,238],[36,192,36,206],[36,96,36,110],[36,128,36,142],[36,160,36,174],[35,224,35,255],[34,96,34,127],[34,128,34,159],[34,160,34,191],[34,192,34,223],[35,192,35,223],[35,128,35,159],[31,112,31,114],[35,160,35,191],[31,149,31,159],[63,0,63,31],[58,0,58,7],[62,0,62,31],[44,0,44,31],[49,0,52,31],[53,0,56,31],[46,25,46,31],[30,12,30,13],[31,13,31,31],[37,0,37,7],[42,0,42,31],[32,0,32,14],[33,0,33,31],[30,0,30,5],[30,6,30,8],[32,15,32,16],[41,0,41,31],[32,17,32,31],[36,0,36,14],[43,8,43,10],[43,0,43,7],[34,0,34,31]]}
["PLAN EXCLUSIVO PARA SOCIOS DINERS CLUB"]
[]
[]
[]
["QUITO: Calle Francisco Andrade Marín  E 6-101 y Av. Eloy Alfaro.\nTelf.  600-9390"]
[]
["ORDEN DE INSTALACIÓN DEL SISTEMA SATELITAL"]
["FECHA:",null,null,null,null,{"$f":"+FORM!F9","v":"2025-02-07"},null,null,null,null,null,null,null,null,null,"VALOR VEHICULO:",null,null,null,null,null,null,{"$f":"FORM!F101","v":10000}]
["NOMBRE:",null,null,null,null,{"$f":"FORM!Q38","v":"PRIMER NOMBRE SEGUNDO NOMBRE PRIMER APELLIDO SEGUNDO APELLIDO"}]
["DIRECCIÓN:",null,null,null,null,{"$f":"+FORM!F46","v":"CARCELEN"}]
["TELEFONOS:",null,null,null,null,{"$f":"CONCATENATE(FORM!F38,\" \",FORM!L38)","v":"CELULAR CONVENCIONAL"},null,null,null,null,null,null,null,null,null,null,null,"CIUDAD:",null,null,null,{"$f":"+FORM!F26","v":"GUAYAQUIL"}]
["CONCESIONARIO:",null,null,null,null,null,null,{"$f":"+FORM!F14","v":"CONCESIONARIO"}]
["PLAN",null,null,{"$f":"+A32","v":"Con dispositivo Concesionario"}]
["DATOS DEL VEHICULO"]
["MARCA:",null,null,{"$f":"+FORM!F78","v":"HYUNDAI"},null,null,null,null,null,"MODELO:",null,null,null,{"$f":"+FORM!F80","v":"ACCENT"},null,null,null,null,null,"TIPO:",null,null,{"$f":"+FORM!F85","v":"SEDAN"}]
["COLOR:",null,null,{"$f":"+FORM!F89","v":"ROJO"},null,null,null,null,null,"AÑO:",null,null,null,{"$f":"+FORM!F87","v":"2022"},null,null,null,null,null,"PLACA:",null,null,"N/A"]
["MOTOR:",null,null,{"$f":"+FORM!F91","v":"BU456792826RE7"},null,null,null,null,null,"CHASIS:",null,null,null,{"$f":"+FORM!F93","v":"CG5342892U"},null,null,null,null,null,"USO:",null,null,"PERSONAL/FAMILIAR"]
["El asegurado deberá llevar el vehículo para la instalación del sistema Maresa Satelital, en un plazo de 8 días posteriores a la compra del vehículo. De no hacerlo, pierde el derecho a indemnización en el caso de un eventual robo total."]
[]
[]
[]
[]
[]
[null,null,null,null,null,"CONCESIONARIO",null,null,null,null,null,null,null,null,null,null,null,null,null,null,null,"TARJETAHABIENTE"]
[]
["AUTORIZACIÓN ORDEN DE CARGO"]
[{"$f":"+FORM!F26","v":"GUAYAQUIL"},null,null,null,null,null,null,null,null,null,null,",",{"$f":"+F8","v":"2025-02-07"}]
[]
["En mi calidad de socio Diners Club No.",null,null,null,null,null,null,null,null,null,null,null,null,null,{"$f":"FORM!F147","v":"XXXXXXXXXX1234"},null,null,null,null,null,"autorizo  libre y  voluntariamente",null,null,null,null,null,null,null,null,null,null,null,null,null,null,null,null,null,null,null,null,null,null,null,null,{"$f":"CONCATENATE(FORM!AP143,FORM!AV143)","v":""},null,null,null,null,null,null,"autorizo libre y voluntariamente a ",null,null,null,null,null,null,null,null,null,null,null,"En mi calidad de socio Diners Club No.",null,null,null,null,null,null,null,null,null,null,null,null,{"$f":"CONCATENATE(FORM!BV143,FORM!CB143)","v":""},null,null,null,null,null,null,"autorizo libre y voluntariamente a ",null,null,null,null,null,null,null,null,null,null,null,"En mi calidad de socio Diners Club No.",null,null,null,null,null,null,null,null,null,null,null,null,{"$f":"CONCATENATE(FORM!DB143,FORM!DH143)","v":""},null,null,null,null,null,null,"autorizo libre y voluntariamente a ",null,null,null,null,null,null,null,null,null,null,null,"En mi calidad de socio Diners Club No.",null,null,null,null,null,null,null,null,null,null,null,null,{"$f":"CONCATENATE(FORM!EH143,FORM!EN143)","v":""},null,null,null,null,null,null,"autorizo libre y voluntariamente a ",null,null,null,null,null,null,null,null,null,null,null,"En mi calidad de socio Diners Club No.",null,null,null,null,null,null,null,null,null,null,null,null,{"$f":"CONCATENATE(FORM!FN143,FORM!FT143)","v":""},null,null,null,null,null,null,"autorizo libre y voluntariamente a ",null,null,null,null,null,null,null,null,null,null,null,"En mi calidad de socio Diners Club No.",null,null,null,null,null,null,null,null,null,null,null,null,{"$f":"CONCATENATE(FORM!GT143,FORM!GZ143)","v":""},null,null,null,null,null,null,"autorizo libre y voluntariamente a ",null,null,null,null,null,null,null,null,null,null,null,"En mi calidad de socio Diners Club No.",null,null,null,null,null,null,null,null,null,null,null,null,{"$f":"CONCATENATE(FORM!HZ143,FORM!IF143)","v":""},null,null,null,null,null,null,"autorizo libre y voluntariamente a "]
["a BANCO DINERS CLUB DEL ECUADOR S.A., se cargue a mi señalada tarjeta de manera mensual"]
["el valor de US$",null,null,null,null,null,{"$f":"+FORM!F139","v":0},null,null,"durante",null,null,{"$f":"+FORM!F105","v":24},null,"meses, que corresponde a la compra de un sistema"]
[{"$f":"+FORM!F113","v":"Con dispositivo Concesionario"},null,null,null,null,null,null,null,null,null,null,null,null,"de  conformidad  al  acuerdo  que  he  llegado  con",null,null,null,null,null,null,null,null,null,null,null,null,null,null,null,null,null,null,null,null,null,null,null,null,null,null,null,null,null,null,null,null,null,null,"durante",null,null,{"$f":"+FORM!AP103*12","v":0},null,"meses, que corresponde a la ",null,null,null,null,null,null,null,null,null,null,"de manera mensual el valor de US$",null,null,null,null,null,null,null,null,null,null,null,null,null,null,null,"durante",null,null,{"$f":"+FORM!BV103*12","v":0},null,"meses, que corresponde a la ",null,null,null,null,null,null,null,null,null,null,"de manera mensual el valor de US$",null,null,null,null,null,null,null,null,null,null,null,null,null,null,null,"durante",null,null,{"$f":"+FORM!DB103*12","v":0},null,"meses, que corresponde a la ",null,null,null,null,null,null,null,null,null,null,"de manera mensual el valor de US$",null,null,null,null,null,null,null,null,null,null,null,null,null,null,null,"durante",null,null,{"$f":"+FORM!EH103*12","v":0},null,"meses, que corresponde a la ",null,null,null,null,null,null,null,null,null,null,"de manera mensual el valor de US$",null,null,null,null,null,null,null,null,null,null,null,null,null,null,null,"durante",null,null,{"$f":"+FORM!FN103*12","v":0},null,"meses, que corresponde a la ",null,null,null,null,null,null,null,null,null,null,"de manera mensual el valor de US$",null,null,null,null,null,null,null,null,null,null,null,null,null,null,null,"durante",null,null,{"$f":"+FORM!GT103*12","v":0},null,"meses, que corresponde a la ",null,null,null,null,null,null,null,null,null,null,"de manera mensual el valor de US$",null,null,null,null,null,null,null,null,null,null,null,null,null,null,null,"durante",null,null,{"$f":"+FORM!HZ103*12","v":0},null,"meses, que corresponde a la "]
["CARSEG S.A. esto es, un crédito diferido a",null,null,null,null,null,null,null,null,null,null,null,null,null,null,{"$f":"+M31","v":24},null,"meses plazo sin intereses, valores que me"]
["comprometo a cancelar de manera incondicional y dentro de los plazos estipulados."]
["Asímismo, expresamente me obligo a no revocar la presente autorización, sin previo consentimiento por escrito de CARSEG S.A., por lo que libero de toda responsabilidad a BANCO DINERS CLUB DEL ECUADOR S.A. por los cargos efectuados en base a la presente autorización.",null,null,null,null,null,null,null,null,null,null,null,null,null,null,null,null,null,null,null,null,null,null,null,null,null,null,null,null,null,null,null,null,null,null,null,null,null,null,null,null,null,null,null,null,null,null,null,null,null,null,null,null,null,null,null,null,null,null,null,null,null,null,null,"Asímismo, expresamente me obligo a no revocar la presente autorización, sin previo consentimiento por ",null,null,null,null,null,null,null,null,null,null,null,null,null,null,null,null,null,null,null,null,null,null,null,null,null,null,null,null,null,null,null,"Asímismo, expresamente me obligo a no revocar la presente autorización, sin previo consentimiento por ",null,null,null,null,null,null,null,null,null,null,null,null,null,null,null,null,null,null,null,null,null,null,null,null,null,null,null,null,null,null,null,"Asímismo, expresamente me obligo a no revocar la presente autorización, sin previo consentimiento por ",null,null,null,null,null,null,null,null,null,null,null,null,null,null,null,null,null,null,null,null,null,null,null,null,null,null,null,null,null,null,null,"Asímismo, expresamente me obligo a no revocar la presente autorización, sin previo consentimiento por ",null,null,null,null,null,null,null,null,null,null,null,null,null,null,null,null,null,null,null,null,null,null,null,null,null,null,null,null,null,null,null,"Asímismo, expresamente me obligo a no revocar la presente autorización, sin previo consentimiento por ",null,null,null,null,null,null,null,null,null,null,null,null,null,null,null,null,null,null,null,null,null,null,null,null,null,null,null,null,null,null,null,"Asímismo, expresamente me obligo a no revocar la presente autorización, sin previo consentimiento por "]
["De igual manera,  autorizo en caso de pérdida,  hurto,  robo o cualquier otra circunstancia que merezca ser cambiado mi actual número de tarjeta, se cuenta con el nuevo que se me  asigne para cancelar todos mis consumos de manera incondicional dentro del periodo respectivo, de tal forma de que mis obligaciones no queden en mora por los conceptos antes mencionados y hasta su total cancelación.",null,null,null,null,null,null,null,null,null,null,null,null,null,null,null,null,null,null,null,null,null,null,null,null,null,null,null,null,null,null,null,null,null,null,null,null,null,null,null,null,null,null,null,null,null,null,null,null,null,null,null,null,null,null,null,null,null,null,null,null,null,null,null,"De igual manera,  autorizo en caso de pérdida,  hurto,  robo o cualquier otra circunstancia que merezca ",null,null,null,null,null,null,null,null,null,null,null,null,null,null,null,null,null,null,null,null,null,null,null,null,null,null,null,null,null,null,null,"De igual manera,  autorizo en caso de pérdida,  hurto,  robo o cualquier otra circunstancia que merezca ",null,null,null,null,null,null,null,null,null,null,null,null,null,null,null,null,null,null,null,null,null,null,null,null,null,null,null,null,null,null,null,"De igual manera,  autorizo en caso de pérdida,  hurto,  robo o cualquier otra circunstancia que merezca ",null,null,null,null,null,null,null,null,null,null,null,null,null,null,null,null,null,null,null,null,null,null,null,null,null,null,null,null,null,null,null,"De igual manera,  autorizo en caso de pérdida,  hurto,  robo o cualquier otra circunstancia que merezca ",null,null,null,null,null,null,null,null,null,null,null,null,null,null,null,null,null,null,null,null,null,null,null,null,null,null,null,null,null,null,null,"De igual manera,  autorizo en caso de pérdida,  hurto,  robo o cualquier otra circunstancia que merezca ",null,null,null,null,null,null,null,null,null,null,null,null,null,null,null,null,null,null,null,null,null,null,null,null,null,null,null,null,null,null,null,"De igual manera,  autorizo en caso de pérdida,  hurto,  robo o cualquier otra circunstancia que merezca "]
[null,null,null,null,null,null,null,null,null,null,null,null,null,null,null,null,null,null,null,null,null,null,null,null,null,null,null,null,null,null,null,null,null,null,null,null,null,null,null,null,null,null,null,null,null,null,null,null,null,null,null,null,null,null,null,null,null,null,null,null,null,null,null,null,"hasta su total cancelación.",null,null,null,null,null,null,null,null,null,null,null,null,null,null,null,null,null,null,null,null,null,null,null,null,null,null,null,null,null,null,null,"hasta su total cancelación.",null,null,null,null,null,null,null,null,null,null,null,null,null,null,null,null,null,null,null,null,null,null,null,null,null,null,null,null,null,null,null,"hasta su total cancelación.",null,null,null,null,null,null,null,null,null,null,null,null,null,null,null,null,null,null,null,null,null,null,null,null,null,null,null,null,null,null,null,"hasta su total cancelación.",null,null,null,null,null,null,null,null,null,null,null,null,null,null,null,null,null,null,null,null,null,null,null,null,null,null,null,null,null,null,null,"hasta su total cancelación.",null,null,null,null,null,null,null,null,null,null,null,null,null,null,null,null,null,null,null,null,null,null,null,null,null,null,null,null,null,null,null,"hasta su total cancelación."]
["Atentamente,"]
[]
[]
[]
[{"$f":"F9","v":"PRIMER NOMBRE SEGUNDO NOMBRE PRIMER APELLIDO SEGUNDO APELLIDO"}]
[{"$f":"S48","v":"XXXXXXXXXX"}]
["Caducidad Tarjeta:",null,null,null,null,null,null,null,{"$f":"+FORM!F153","v":"2023-07-01"}]
["DECLARACION ADICIONAL"]
[]
[{"$f":"A42","v":"PRIMER NOMBRE SEGUNDO NOMBRE PRIMER APELLIDO SEGUNDO APELLIDO"},null,null,null,null,null,null,null,null,null,null,null,null,null,", mayor de edad, de estado civil ",null,null,null,null,null,null,null,null,null,null,{"$f":"+IF(FORM!F64<>\"\",\"CASADO\",\"SOLTERO\")","v":"SOLTERO"}]
[", portador de la cédula de ciudadanía o pasaporte No.",null,null,null,null,null,null,null,null,null,null,null,null,null,null,null,null,null,{"$f":"FORM!F40","v":"XXXXXXXXXX"},null,null,null,null,", por medio de la presente"]
["realizo la siguiente declaración:"]
["Declaro de manera expresa que autorizo a la compañía CARSEG S.A., para que en el evento de que la compañía Banco Diners Club del Ecuador S.A., lo requiera, haga conocer la información en relación a la ubicación del vehículo, así mismo podrá bloquear el vehículo a la sola solicitud de Banco Diners Club del Ecuador S.A."]
[]
[]
[]
["Por tratarse de una autorización realizada de manera libre y voluntaria, declaro que no interpondré contra Banco Diners Club del Ecuador S.A., o la compañía CARSEG S.A., ningún tipo de acción judicial o administrativa  por la ejecución de las acciones descritas en el presente documento."]
[]
[]
[]
[]
["Atentamente,"]
[]
[]
[]
[{"$f":"A42","v":"PRIMER NOMBRE SEGUNDO NOMBRE PRIMER APELLIDO SEGUNDO APELLIDO"}]
[{"$f":"A43","v":"XXXXXXXXXX"}]

{"sheet":"AIG- Cotizador Seguro","index":13,"n_rows":10,"n_cols":9,"rows_kept":10,"cut":false,"hidden":false,"merged":[[0,1,0,4]]}
[null,"Cotizador"]
[]
[]
[]
["MARCA",{"$f":"+FORM!F78","v":"HYUNDAI"},null,null,"Año","Cuotas","Prima Neta","Prima Total","Cuota"]
["MODELO",{"$f":"+FORM!F80","v":"ACCENT"},null,null,1,{"$f":"+CálculosSeguro!B2","v":12},{"$f":"+CálculosSeguro!I2","v":1260.0000000000002},{"$f":"+CálculosSeguro!I9","v":1507.0060000000001},{"$f":"+IFERROR(H6/F6,0)","v":125.58383333333335}]
["Valor Asegurado",{"$f":"COTIZADOR!$F$40","v":35000},"Valor total de vehículo incluido extras (total de factura/s).",null,2,{"$f":"+CálculosSeguro!B13","v":12},{"$f":"+CálculosSeguro!I13","v":1108.8000000000002},{"$f":"+CálculosSeguro!I20","v":1326.1708000000003},{"$f":"+IFERROR(H7/F7,0)","v":110.51423333333337}]
["Crédito Meses",{"$f":"+FORM!F105","v":24},null,null,3,{"$f":"+CálculosSeguro!B24","v":0},{"$f":"+CálculosSeguro!I24","v":0},{"$f":"+CálculosSeguro!I31","v":0},0]
[null,null,null,null,4,{"$f":"+CálculosSeguro!B35","v":0},{"$f":"+CálculosSeguro!I35","v":0},{"$f":"+CálculosSeguro!I42","v":0},0]
[null,null,null,null,5,{"$f":"+CálculosSeguro!B46","v":0},{"$f":"+CálculosSeguro!I46","v":0},{"$f":"+CálculosSeguro!I53","v":0},0]

{"sheet":"AIG-Solicitud Cetificado","index":14,"n_rows":197,"n_cols":11,"rows_kept":197,"cut":false,"hidden":false,"merged":[[164,6,166,11],[167,6,170,11],[146,0,149,4],[146,6,149,11],[150,0,153,4],[132,4,132,5],[132,6,132,7],[194,6,195,11],[195,0,197,4],[156,6,157,11],[157,0,159,4],[158,6,159,11],[115,0,115,11],[117,0,117,11],[118,0,118,11],[127,6,127,7],[128,4,128,5],[128,6,128,7],[198,0,214,11],[142,0,143,11],[180,0,182,4],[184,6,187,11],[185,0,186,4],[188,6,189,11],[189,0,192,4],[191,6,192,11],[171,0,172,4],[173,0,174,4],[173,6,175,11],[175,0,176,4],[177,0,179,4],[160,6,161,11],[162,0,163,4],[162,6,163,11],[152,6,155,11],[154,0,156,4],[124,0,124,11],[136,0,136,11],[139,10,139,11],[119,0,119,11],[120,0,120,11],[121,0,121,11],[122,0,122,11],[123,0,123,11],[130,6,130,7],[131,4,131,5],[131,6,131,7],[129,4,129,5],[129,6,129,7],[134,4,134,5],[134,6,134,7],[133,4,133,5],[133,6,133,7],[126,4,126,7],[127,4,127,5],[78,0,79,11],[72,0,72,11],[73,0,77,11],[62,0,64,11],[65,0,65,11],[66,0,67,11],[68,0,71,11],[16,0,17,11],[39,0,40,11],[56,0,57,11],[59,0,61,11],[4,0,4,11],[5,0,5,11],[6,0,6,11],[9,0,10,11],[14,3,14,4],[139,2,139,3],[138,10,138,11],[97,0,97,8],[98,0,99,5],[98,6,98,8],[99,6,99,8],[100,0,100,8],[101,0,101,8],[102,0,102,8],[103,0,103,8],[104,0,105,5],[104,6,104,8],[105,6,105,8],[107,0,107,8],[108,0,108,8],[106,9,106,11],[107,9,107,11],[108,9,108,11],[130,4,130,5],[112,6,112,8],[113,6,113,8],[80,1,80,3],[80,6,80,7],[106,0,106,8],[95,0,96,11],[97,9,97,11],[98,9,99,11],[100,9,100,11],[109,0,109,8],[110,0,110,8],[111,0,111,8],[109,9,109,11],[110,9,110,11],[111,9,111,11],[81,0,93,11],[112,9,112,11],[113,9,113,11],[101,9,101,11],[102,9,102,11],[103,9,103,11],[104,9,104,11],[105,9,105,11],[112,0,113,5]]}
[]
[]
[]
[]
["SEGURO DE VEHÍCULOS"]
["Diners Financiados"]
["Solicitud certificado"]
[]
[]
["DATOS DEL ASEGURADO"]
[]
[]
["Nombres Completos:",null,"BANCO DINERS CLUB DEL ECUADOR S.A."]
[]
["Número de Cédula / RUC / Pasaporte:",null,null,1790283380001]
[]
["DATOS DEL ASEGURADO"]
[]
[]
["Apellido Paterno:",null,{"$f":"+FORM!F34","v":"PRIMER APELLIDO"},null,null,null,"Apellido Materno:",null,{"$f":"+FORM!L34","v":"SEGUNDO APELLIDO"}]
[]
["Nombres:",null,{"$f":"+FORM!F36&\" \"&FORM!L36","v":"PRIMER NOMBRE SEGUNDO NOMBRE"},null,null,null,"Número de Cédula / RUC / Pasaporte:",null,null,{"$f":"+FORM!F40","v":"XXXXXXXXXX"}]
[]
["Estado Civil:",null,{"$f":"+COTIZADOR!F32","v":"Casado"},null,"Género:",null,null,"Fecha de Nacimiento:"]
[]
["Nacionalidad:",null,{"$f":"+'CONOZCA A SU CLIENTE PN(2)'!K13","v":0},null,null,null,"Lugar de Nacimiento:",null,{"$f":"+C26","v":0}]
[]
["Actividad económica / Ocupación:",null,null,null,null,null,"Ingresos Mensuales:"]
[]
["Dirección Domicilio:",null,{"$f":"+FORM!F46","v":"CARCELEN"},null,null,null,"Teléfono Domicilio:",null,{"$f":"+FORM!F38","v":"CELULAR"}]
[]
["Dirección Oficina:",null,{"$f":"+FORM!F54","v":"AMAZONAS Y AYORA"},null,null,null,"Teléfono Oficina:",null,{"$f":"+FORM!F56","v":"022000000"}]
[]
["Teléfono Celular:",null,{"$f":"+FORM!L38","v":"CONVENCIONAL"},null,null,null,"Correo Electrónico:",null,{"$f":"+FORM!F50","v":"Correo"}]
[]
[]
[null,null,null,"*Datos solicitados de conformidad a la Resolución No. JB-2012-2147 de 26 de abril de 2012 y sus posteriores reformas"]
[]
[]
["DATOS DEL BIEN ASEGURADO"]
[]
[]
["Conductor:",{"$f":"+C20&\" \"&I20&\" \"&C22","v":"PRIMER APELLIDO SEGUNDO APELLIDO PRIMER NOMBRE SEGUNDO NOMBRE"},null,null,null,null,"Fecha vencimiento licencia:"]
[]
["Marca:",{"$f":"+FORM!F78","v":"HYUNDAI"},null,null,null,null,"Modelo:",{"$f":"+FORM!F80","v":"ACCENT"}]
[]
["Tipo:",{"$f":"+FORM!F85","v":"SEDAN"},null,null,"Año:",{"$f":"+FORM!F87","v":"2022"},"Color:",{"$f":"+FORM!F89","v":"ROJO"},null,"Placa/CPN:"]
[]
["Número Motor:",null,{"$f":"+FORM!F91","v":"BU456792826RE7"},null,null,null,"Número Chasis:",null,{"$f":"+FORM!F93","v":"CG5342892U"}]
[]
[null,null,null,null,null,null,"Accesorios Extras",null,"si aplica, completar descripción, marca, valor a continuación."]
[]
["Descripción:",null,null,null,"Descripción:",null,null,null,null,"Descripción:"]
["Marca:",null,null,null,"Marca:",null,null,null,null,"Marca:"]
["Valor:",null,null,null,"Valor:",null,null,null,null,"Valor:"]
[]
["DECLARACIONES DEL ASEGURADO"]
[]
[]
["Declaro libre y voluntariamente que el seguro solicitado a la compañía AIG-Metropolitana Cía. de Seguros y Reaseguros S.A., ampara\nbienes de procedencia lícita y que los mismos no están ligados con actividades de narcotráfico, lavado de activos o financiamiento del\nterrorismo; igualmente declaro que los fondos con los cuales se pagará la prima de este seguro tienen origen lícito y no guarda ninguna\nrelación con las actividades mencionadas anteriormente."]
[]
[]
["Declaro que la información contenida en este formulario es verdadera, completa y proporciona la información de modo confiable y\nactualizada; además declaro conocer y aceptar que es mi obligación actualizar anualmente mis datos personales, así como el comunicar\ny documentar de manera inmediata a AIG-Metropolitana Cía. de Seguros y Reaseguros S.A. cualquier cambio en la información que\nhubiere proporcionado. Durante la vigencia de la relación con la compañía me comprometo a proveer de la documentación e\ninformación que me sea solicitada."]
[]
[]
["Declaro que a la fecha de la firma de esta declaración, he recibido el certificado de seguro que contiene resumen de las condiciones\ngenerales de la Póliza a la cual se adhiere la presente declaración y declaro conocerlas y aceptarlas."]
["\nAdemás, acepto recibir información comercial y promocional por canales ordinarios o electrónicos relativos a productos y servicios que\nAIG-Metropolitana Cía. de Seguros y Reaseguros S.A. preste actualmente o decida prestar en un futuro, conservándose con esta finalidad\nhasta que indique mi manifestación expresa en contrario."]
[]
["En cumplimiento de la Ley Orgánica de Protección de Datos Personales y la normativa vigente de protección de datos, con su consentimiento AIG-Metropolitana Cía. de Seguros y Reaseguros S.A. (“AIG-Metropolitana”) y sus asociadas (casa matriz, filiales, pares, subsidiarias, entidades relacionadas, socios, aliados comerciales estratégicos y proveedores) podrán realizar tratamiento de sus datos personales, los cuales incluyen recolectar, archivar, procesar, y almacenar, actualizar, realizar consultas o reportes de riesgo crediticio, transmitir dentro del territorio nacional, sus datos de contactabilidad, datos de identificación y otros necesarios para proporcionar los servicios y productos de AIG-Metropolitana y sus asociadas. AIG-Metropolitanta y sus asociadas se rigen bajo lo establecido en su Política de Privacidad disponible en su sitio web: www.aig.com.ec., la que usted declara conocer."]
[]
[]
[]
["Asimismo, da su consentimiento explícito para la transferencia internacional de datos en los términos y para las finalidades antes descritas."]
["[ X ] He leído y acepto el tratamiento para las finalidades descritas.\n[ ] He leído y rechazó el tratamiento para las finalidades descritas”."]
[]
[]
[]
[]
["AUTORIZACION DE CARGO"]
[]
["Yo, ",{"$f":"+FORM!Q38","v":"PRIMER NOMBRE SEGUNDO NOMBRE PRIMER APELLIDO SEGUNDO APELLIDO"},null,null,", titular de la tarjeta número,",null,{"$f":"+FORM!F147","v":"XXXXXXXXXX1234"},null,"por medio de la presente, solicito a usted "]
["ordenar a quien corresponda, se cargue a mi Tarjeta de Crédito BANCO DINERS el valor correspondiente a la prima que cause esta solicitud de seguro por concepto de la prima de Seguro de Vehículos, sobre la tarjeta de crédito que soy titular.\nDebo y pagaré incondicionalmente al Emisor de la tarjeta de crédito el total de los valores expresados en esta Autorización de Orden de Cargo, en el lugar y fecha que se convenga. En caso de mora, pagaré la tasa máxima autorizada para el Emisor de la tarjeta de crédito y los gastos en que esta institución haya incurrido por las gestiones de la cartera vencida.\nPor tal fin, me comprometo a efectuar los pagos de mi tarjeta de crédito al día y me obligo a mantener los fondos suficientes para cubrir el importe correspondiente ya que lo contrario, de no estar al día en los pagos, no tendré cobertura. En caso de no poder efectuar el débito por carecer de fondos y que se acumulen varias cuotas, autorizo a que se debite una sola vez todas las cuotas atrasadas.\nPor otra parte, acepto que se de por terminado el contrato de seguro y reconozco que me será retirada la cobertura por las siguientes condiciones: después que la Aseguradora haga los intentos de débito por 3 ocasiones, si llegase a tener 90 días de vencido de una o más cuotas, si no se pudiese recaudar las cuotas respectivas por: fondos insuficientes, cancelación de la cuenta, cambio de la misma, o cualquier otro motivo no imputable a ella."]
[]
[]
[]
[]
[]
[]
[]
[]
[]
[]
[]
[]
[null,null,"POLIZA MAESTRA NRO.",null,null,null,"CERTIFICADO INDIVIDUAL NRO"]
["Mediante este documento, AIG-METROPOLITANA CÍA. DE SEGUROS Y REASEGUROS S.A. certifica que el seguro que usted ha\ncontratado cubre pérdidas parciales y totales del bien asegurado de acuerdo a los montos establecidos en el presente certificado:"]
[]
["COBERTURAS",null,null,null,null,null,null,null,null,"LÍMITE"]
["1. Responsabilidad Civil Límite Único Combinado",null,null,null,null,null,"1.1 Lesiones corporales",null,null,50000]
[null,null,null,null,null,null,"1.2 Daños a la Propiedad Ajena"]
["2. Pérdida Parcial del Vehículo por Daños",null,null,null,null,null,null,null,null,{"$f":"+'AIG- Cotizador Seguro'!B7","v":35000}]
["3. Pérdida Total del Vehículo por Daños",null,null,null,null,null,null,null,null,{"$f":"+J101","v":35000}]
["4. Pérdida Parcial del Vehículo por Robo",null,null,null,null,null,null,null,null,{"$f":"+J102","v":35000}]
["5. Pérdida Total del Vehículo por Robo",null,null,null,null,null,null,null,null,{"$f":"+J103","v":35000}]
["6. Lesiones a Ocupantes del vehículo",null,null,null,null,null,"6.1 Gastos Médicos por ocupante*",null,null,5000]
[null,null,null,null,null,null,"6.2 Accidentes Personales por ocupante*",null,null,10000]
["7. Gastos de Grúa, Transporte y Protección del vehículos",null,null,null,null,null,null,null,null,200]
["8. Amparo jurídico en proceso penal",null,null,null,null,null,null,null,null,1000]
["9. Llave Protegida",null,null,null,null,null,null,null,null,150]
["10. Documentos Protegidos",null,null,null,null,null,null,null,null,100]
["11. Muerte Accidental o Incapacidad Total y Permanente**",null,null,null,null,null,null,null,null,10000]
["12. Amparo Patrimonial",null,null,null,null,null,null,null,null,{"$f":"+J103","v":35000}]
["13 Auto Sustituto***",null,null,null,null,null,"13.1 Pérdidas Parciales ****",null,null,"10 días consecutivos por evento"]
[null,null,null,null,null,null,"13.2 Pérdidas Totales",null,null,"20 días consecutivos"]
[]
["* El número de ocupantes asegurados será el indicado en la matrícula del vehículo asegurado.\n** Como consecuencia de accidente de tránsito mientras sea conductor o pasajero del vehículo asegurado en la presente póliza.\n*** Vehículos con valor asegurado entre $ 0 y $ 20,000.00 se otorga un auto gama económica, vehículos con valor asegurado entre\n$ 20,001.00 y $ 40,000.00 se otorga un auto gama media, vehículos con valor asegurado de $ 40,001.00 en adelante se otorga un auto\ngama alta.\n**** Aplica si el valor del siniestro es superior a $ 1,000.00 y se haya emitido la orden de reparación que supere los 3 días laborables."]
[]
["ASISTENCIAS Y COBERTURAS ADICIONALES"]
["Asistencia AIG: 24 horas, 365 días. Asistencia legal telefónica e insitu en: Quito, Guayaquil, Cuenca, Ambato, Manta y Portoviejo"]
["Gastos de transporte: Hasta $600"]
["DEDUCIBLES"]
["Pérdidas  parciales: Livianos: Primer evento: 10% valor siniestro, mínimo 1% valor asegurado, no inferior a USD $200, Segundo evento: 10% valor siniestro, mínimo 1% valor asegurado, no inferior a US $350. Segundo evento:10% valor siniestro, minimo 1% valor asegurado, no inferior a US $300.\nPérdida total por Daños: 15% valor asegurado"]
["Uso distinto al asegurado o recorrido superior a 30.000 kmtrs al año o su equivalente mensual. -10% valor siniestro, minimo 2% valor asegurado, no inferior a US$ 500."]
["Pérdida total por robo: Todo vehiculo cuyo valor asegurado sea igual o superior a US$20.000,00 a vehículos tipo jeep o camioneta de hasta 5 años de antigüedad, deberá mantener instalada y en funcionamiento el dispositivo de seguridad satelital o cualquier dispositivo de rastreo, paralización y recuperación, en caso de no cumplir con dicho requisito se aplicarán los siguientes deducibles:\n\n- Pérdida total por robo (vehículos que no requieren dispositivos Livianos), 15% del valor asegurado.\n- Pérdida total por robo (vehículos que requieren dispositivos y lo mantengan instalado y en funcionamiento), 5% del valor asegurado."]
["Depreciación: Vehículos Nuevos: 2año 12% - 3er año 8% - 4to en adelante 5% anual. Vehículos Usados: 5% anual"]
[]
[null,null,null,null,"DESGLOSE DE PRIMA"]
[null,null,null,null,"Valor Asegurado:",null,{"$f":"+'AIG- Cotizador Seguro'!B7-'AIG-Solicitud Cetificado'!B55-'AIG-Solicitud Cetificado'!F55-'AIG-Solicitud Cetificado'!K55","v":35000}]
[null,null,null,null,"Valor Extras:",null,{"$f":"+B55+F55+K55","v":0}]
[null,null,null,null,"Prima Neta Anual:",null,{"$f":"+CálculosSeguro!I2","v":1260.0000000000002}]
[null,null,null,null,"Contribución SCVS:",null,{"$f":"+CálculosSeguro!I4","v":44.100000000000016}]
[null,null,null,null,"Seguro Campesino:",null,{"$f":"+CálculosSeguro!I5","v":6.3000000000000016}]
[null,null,null,null,"Derechos de emisión:",null,{"$f":"+CálculosSeguro!I6","v":0.04}]
[null,null,null,null,"IVA:",null,{"$f":"+CálculosSeguro!I8","v":196.566}]
[null,null,null,null,"Total",null,{"$f":"+CálculosSeguro!I9","v":1507.0060000000001}]
[]
["La renovación del presente certificado es anual. La cobertura se mantendrá vigente mientras el (la) Asegurado(a) se encuentre al día en los pagos\nde la prima. El presente certificado se enmarca en las Condiciones Generales de la Póliza de Vehículos aprobadas mediante resolución de la\nSuperintendencia de Compañías, Valores y Seguros No. SCVS-6-7-CG-34-515004420-10062020."]
[]
["Vigencia de la póliza desde (12:00):",null,null,"2024-07-01",null,null,"Vigencia del certificado desde (12:00):",null,null,null,{"$f":"$C$140","v":"2025-02-07"}]
["Fecha de emisión:",null,{"$f":"FORM!$F$9","v":"2025-02-07"},null,null,null,"Vigencia del certificado hasta (12:00):",null,null,null,{"$f":"EDATE(FORM!$F$9,FORM!$F$105)","v":"2027-02-07"}]
["Nota: El inicio de la cobertura de su póliza se ejecutará una vez sea entregado el bien",null,null,null,null,null,"Forma de Pago: Tarjeta de crédito"]
[]
["Resumen de la Condiciones Generales de la Polóliza de Vehículos"]
[]
[]
["Definiciones:"]
["Asegurado: La persona natural o juridica designada en la poliza, incluyendo tambien a cualquier otra persona que estuviere usando el vehículo asegurado o fuere responsable legalmente de tal uso, siempre que la conduccion del mismo ejerza bajo el control del Asegurado o con su anuencia.",null,null,null,null,null,"determinen el estado de riesgo. La reticencia, inexactitud o falsedad de aquellas circunstancias, que conocidas por la Campaña, la hubieren hecho desisitir de la celebración del Contrato o inducida a estipular condiciones mas gravsas, producen la nulidad relativa del Contrato de Seguro."]
[]
[]
[]
["Vehiculos particulares: Se entenderá por vehiculos particulares, aquellos que sean usados exclusivamente para el servicio personal de Asegurado y en ningún caso para arquilarlos o para transportar pasajeros y/o carga, mediante el cobre de renta, pasajes o flete. "]
[null,null,null,null,null,null,"Obligaciones del asegurado al ocurrir un siniestro:"]
[null,null,null,null,null,null,"a) Proteger al vehículo, puesto que cualquier pérdida adicional por falta de protección no será indemnizada. Los gastos razonables efectuados para dar dicha protección serán considerados como si hubieran sido autorizados por la Compañía."]
[]
["Ocupantes del vehículo: Se entenderá por ocupantes, el conductor y cualquier otra persona que viaje dentro del vehiculo asegurado en los lugares normalmente destinados para llevar personas. "]
[]
[null,null,null,null,null,null,"b) Dará aviso a a Compañía dentro de los diez (10) días calendario siguientes a la fecha en la que se tuvo conocimiento del siniestro."]
["Franquicia deducible: Es la cantidad que en cada siniestro deberá ser cubierta por el Asegurado. La Compañía cubrirá únicamente las sumas que excedan de dicha cantidad."]
[null,null,null,null,null,null,"c) Entregar a la Compañía una copia del respectivo parte policial o copia de la denuncia ante las autoridades respectivas en caso de robo."]
[]
[null,null,null,null,null,null,"d) Llenar el formulario de reporte de accidente, dentro del plazo máximo de diez (10) días despues de dicho aviso."]
["Coberturas:"]
["Cobertura al casco del vehiculo: Todo riesgo con exclusiones nombradas según condiciones generales de la póliza de Vehiculo. ",null,null,null,null,null,"e) En caso que existe un tercero afectado, no realizar ninguna transacción o arreglo, al hacerlo perdera el derecho a indemnización."]
[]
[null,null,null,null,null,null,"f) No autorizar reparación alguna en el vehiculo. Un representante de la compañía realizara la respectiva comprobación de daños y autorizará dicha reparación de ser el caso."]
["Exclusiones:"]
["a) Vehiculos utilizados para carreras o enseñanzas."]
["b) Vehiculos sea destinado al transporte publico, comercial o alquiler.",null,null,null,null,null,"g) Si el vehiculo es llevado a la revisión de tránsito es obligación del propietario realizar los tramites correspondientes para el retiro y traslado del vehículo a una mecanica para la inspección y posterior autorización de reparación por parte de la Compañia."]
["c) Multas que las autoridades impongan a consecuencia de infracciones."]
["d) Daños o perdidas causadas intencionalmente por el asegurado."]
["e) Pérdida o daño producido por el desgaste."]
["f) Cualquier perdida indirecta que sufra el asegurado tales como la privacion del uso del vehiculo, depreciación o perdida del valor comercial del mismo."]
[null,null,null,null,null,null,"Notificación de siniestros:"]
["g) Daños y/o lesiones que sufran ocupantes y bienes del vehiculo, en lo referente a respnsabilidad civil.",null,null,null,null,null,"El Asegurado tendrá la obligación de dar aviso a la Compañía de ocurrencia de un siniestro dentro de los diez (10) diás calendario siguientes a la fecha en la que se tuvo conocimiento del mismo."]
[]
["h) Daños o perdidas causados o consecuencia de imprudencia temeraria o por manejar bajo influencia del alcohol o drogas."]
[null,null,null,null,null,null,"Documentos necesarios:"]
["i) Cuando la licencia del conductor del vehiculo se encuentre caducada por un lapso mayor a (30) días o cuando el conductor carezca de la misma. No son validos los permisos de conduccion provisional.",null,null,null,null,null,"a) Formulario debidamente lleno"]
[null,null,null,null,null,null,"b)Licencia de conducir"]
[null,null,null,null,null,null,"c)Matricula"]
["j) No se cubre radios PULL OUT. Los radios de caratula desmontable, serán indemnizados unicamente si el asegurado entrega a la compañía la carátula, y existe evidencia de forzamineto en las seguridades del vehículo.",null,null,null,null,null,"d) Cédula"]
[null,null,null,null,null,null,"e) Parte policial"]
[null,null,null,null,null,null,"f) Denuncia a titulo personal"]
[]
["Impuestos de Ley y contribuciones:",null,null,null,null,null,"Nota: El presente cerfiticado es un resumen de las Condiciones Generales de la Póliza de Vehículo aprobadas mediante resolución de la Superintendencia de Compañias, Valores y Seguros No. SCVS-6-7-cg-34-515004420. En caso de existir una diferencia entre el presente certificado y las Condiciones Generales, regirán las existencias en la Póliza."]
["Todos los impuestos y contribuciones vigentes y por estarlo, que graven a esta póliza, serán asumidos por asegurado."]
[]
[]
["Pago de Prima y Devoluciones:",null,null,null,null,null,"Nota: El Contratante y/0 Asegurado podrá solicitar a la Superintendencia de Compañias, Valores y Seguros la verificación de este texto."]
["El tomador del seguro está obligado al pago de la prima. Salvo disposición legal o contractual en contrario, deberá hacerlo a mas tardar dentro los 30 días siguientes contando a partir de la fecha de entrega de la póliza o de los certificados o anexos que se expidan con fundamiento de ella."]
[]
[null,null,null,null,null,null,"Para quejas o reclamos comunicarse con nuestro departamento de Servicio al Cliente al correo servicio.cliente@aig.com o al 1800 AIG AIG (244 244)"]
[]
[null,null,null,null,null,null,"Quito: Av. Brasil 293 y Antonio Granda Centeno, Piso PB"]
["Declaracion del estado del riesgo:",null,null,null,null,null,"Guayaquil: Av. Rodrigo Chávez González Parque Empresarial Colón, Edificio Corporativo II, Piso 2, Of. 203"]
["El Contratante y cada Aseguradora, individualmente, estan obligados adeclarar objetivamente, los hechos o circunstancias que"]
[null,null,null,null,null,null,"Cuenca: Av. Ordóñez Lazo 5-42 y Laureles"]

{"sheet":"AIG- Carta Bienvenida (opc)","index":15,"n_rows":11,"n_cols":3,"rows_kept":11,"cut":false,"hidden":false,"merged":[[7,2,7,5],[10,0,53,5]]}
[]
[]
[]
[]
[]
[]
[]
[null,null,{"$f":"+TODAY()","v":"2025-02-07"}]
[]
[]
["\nEstimado Cliente\n\nPresente. -\n\nDe nuestras consideraciones:\n\n\nPor medio de la presente nos complace entregar el certificado de Cobertura de su nuevo vehículo, el cual servirá como respaldo ante cualquier eventualidad.\n\nDesde este momento se encuentra respaldado con la protección que AIG Metropolitana ha diseñado exclusivamente para usted.\n\nLas coberturas de su seguro tienen validez durante el periodo de vigencia del crédito contratado y siempre que usted se encuentre al día en sus pagos.\n\nEn caso de necesitar una de nuestras asistencias o en caso de siniestro se pueden comunicar con el 1800 AIG AIG.\n\nUna vez más agradecemos su preferencia y lo invitamos a seguir disfrutando como cliente de AIG Metropolitana.\n\n\nReciban un cordial saludo.\n\n\nAtentamente,\n\n\n\n\n\nAIG Metropolitana Cía. de Seguros y Reaseguros\nCarlos León García\nGerente de Auto\n\n\n\n\n\n"]

{"sheet":"CHECKLIST VEHICULOS NUEVOS","index":16,"n_rows":38,"n_cols":9,"rows_kept":38,"cut":false,"hidden":false,"merged":[[14,1,14,2],[15,1,19,1],[20,1,36,1],[37,1,37,2]]}
[]
[null,null,"FORMULARIO CHECKLIST VEHICULOS NUEVOS"]
[null,"Tipo de Compra","Vehículo nuevo"]
[null,"Fecha de Compra",{"$f":"FORM!F9","v":"2025-02-07"}]
[null,"Nombre del Vendedor",{"$f":"COTIZADOR!$F$14","v":"NOMBRE Y APELLIDO"}]
[null,"Dirección Vendedor","IÑAQUITO"]
[null,"Telefono Vendedor","0999000000",null,null,null,null,null,"Tipo de vehículo"]
[null,"Cédula de Identidad del Vendedor",{"$f":"FORM!$F$30","v":"XXXXXXXXXX"},null,null,null,null,null,"Vehículo nuevo"]
[null,"Concesionario",{"$f":"FORM!$F$14","v":"CONCESIONARIO"},null,null,null,null,null,"Vehículo usado"]
[null,"Ciudad",{"$f":"FORM!$F$26","v":"GUAYAQUIL"}]
[null,"Nro. de tarjeta del socio",{"$f":"FORM!$F$147","v":"XXXXXXXXXX1234"}]
[null,"Nombre del Socio",{"$f":"CONCATENATE(COTIZADOR!$F$20,COTIZADOR!$L$20,COTIZADOR!$F$18,COTIZADOR!$L$18)","v":"PRIMER NOMBRESEGUNDO NOMBREPRIMER APELLIDOSEGUNDO APELLIDO"}]
[null,"Valor del Vale",{"$f":"FORM!$F$101","v":10000}]
[null,"Plazo en meses",{"$f":"FORM!$F$105","v":24}]
[null,"CHECK LIST DE DOCUMENTOS (Confirme que esté enviando completa la documentación)"]
[null,"Documentos para entregar al Socio","Carta de Bienvanida AIG"]
[null,null,"Certificado de Seguro Colectivo Vida Deudores"]
[null,null,"1 Solicitud - Certificado Seguro de Desgravamen"]
[null,null,"Copia Certificado Seguro AIG (si aplica)"]
[null,null,"Copia Orden de instalación de dispositivo de rastreo Hunter (si aplica)"]
[null,"Documentos para entregar Diners Club","Personas Naturales"]
[null,null,"1 Formulario Conozca a su Cliente (modelo del Formulario de Fideval)."]
[null,null,"3 Copia de cédula del socio, papeleta de votación actualizada y planilla de pago de servicios básicos (hasta tres meses atrás)."]
[null,null,"1 Copia de la declaración del Impuesto a la Renta del año inmediato anterior, según aplique."]
[null,null,"2 Copia de la tabla de amortización."]
[null,null,"4 Contratos de Adhesión al Fideicomiso."]
[null,null,"4 Documento de Reconocimiento de Firmas."]
[null,null,"1 Pagaré."]
[null,null,"3 Autorización de Cargo ."]
[null,null,"1 Declaración de único uso personal o familiar de herramienta."]
[null,null,"1 Solicitud/póliza de Seguro Vehicular o Solicitud de Certificado de Seguro Vehicular AIG de herramienta firmado (si aplica) en caso de contratar el seguro directamente con nosotros."]
[null,null,"1 Endoso Beneficiario en caso de contratar el seguro vehicular externamente."]
[null,null,"3 Fiel Copia de la Factura del Vehículo o 3 copias PDF de factura electrónica con leyenda: NO NEGOCIABLE APORTADO AL FIDEICOMISO MERCANTIL DE GARANTÍA AUTOMOTRIZ DINERS CLUB."]
[null,null,"3 Copia de Cédula del Cónyuge (si aplica)"]
[null,null,"1 Voucher de compra con tarjeta de crédito."]
[null,null,"1 Nombramiento, cédula, y RUC del representante legal del Concesionario."]
[null,null,"1 Orden de instalación de dispositivo de rastreo Hunter de herramienta o documento de contratación de rastreto satelital."]
[null,"POR FAVOR ADJUNTE ESTE FORMULARIO A LOS CONTRATOS Y OTROS DOCUMENTOS ORIGINALES Y FIRMADOS QUE SE REMITE A DINERS CLUB."]

{"sheet":"CHECKLIST VEHICULOS USADOS","index":17,"n_rows":38,"n_cols":9,"rows_kept":38,"cut":false,"hidden":false,"merged":[[14,1,14,2],[15,1,19,1],[20,1,36,1],[37,1,37,2]]}
[]
[null,null,"FORMULARIO CHECKLIST VEHICULOS USADOS"]
[null,"Tipo de Compra","Vehículo usado"]
[null,"Fecha de Compra",{"$f":"FORM!F9","v":"2025-02-07"}]
[null,"Nombre del Vendedor",{"$f":"COTIZADOR!$F$14","v":"NOMBRE Y APELLIDO"}]
[null,"Dirección Vendedor","IÑAQUITO"]
[null,"Telefono Vendedor","0999000000",null,null,null,null,null,"Tipo de vehículo"]
[null,"Cédula de Identidad del Vendedor",{"$f":"FORM!$F$30","v":"XXXXXXXXXX"},null,null,null,null,null,"Vehículo nuevo"]
[null,"Concesionario",{"$f":"FORM!$F$14","v":"CONCESIONARIO"},null,null,null,null,null,"Vehículo usado"]
[null,"Ciudad",{"$f":"FORM!$F$26","v":"GUAYAQUIL"}]
[null,"Nro. de tarjeta del socio",{"$f":"FORM!$F$147","v":"XXXXXXXXXX1234"}]
[null,"Nombre del Socio",{"$f":"CONCATENATE(COTIZADOR!$F$20,COTIZADOR!$L$20,COTIZADOR!$F$18,COTIZADOR!$L$18)","v":"PRIMER NOMBRESEGUNDO NOMBREPRIMER APELLIDOSEGUNDO APELLIDO"}]
[null,"Valor del Vale",{"$f":"FORM!$F$101","v":10000}]
[null,"Plazo en meses",{"$f":"FORM!$F$105","v":24}]
[null,"CHECK LIST DE DOCUMENTOS (Confirme que esté enviando completa la documentación)"]
[null,"Documentos para entregar al Socio","Carta de Bienvanida AIG"]
[null,null,"Certificado de Seguro Colectivo Vida Deudores"]
[null,null,"1 Solicitud - Certificado Seguro de Desgravamen"]
[null,null,"Copia Certificado Seguro AIG (si aplica)"]
[null,null,"Copia Orden de instalación de dispositivo de rastreo Hunter (si aplica)"]
[null,"Documentos para entregar Diners Club","Personas Naturales"]
[null,null,"1 Formulario Conozca a su Cliente (modelo del Formulario de Fideval)."]
[null,null,"3 Copia de cédula del socio, papeleta de votación actualizada y planilla de pago de servicios básicos (hasta tres meses atrás)."]
[null,null,"1 Copia de la declaración del Impuesto a la Renta del año inmediato anterior, según aplique."]
[null,null,"2 Copia de la tabla de amortización."]
[null,null,"4 Contratos de Adhesión al Fideicomiso."]
[null,null,"4 Documento de Reconocimiento de Firmas."]
[null,null,"1 Pagaré."]
[null,null,"3 Autorización de Cargo ."]
[null,null,"1 Declaración de único uso personal o familiar de herramienta."]
[null,null,"1 Solicitud/póliza de Seguro Vehicular o Solicitud de Certificado de Seguro Vehicular AIG de herramienta firmado (si aplica) en caso de contratar el seguro directamente con nosotros."]
[null,null,"1 Endoso Beneficiario en caso de contratar el seguro vehicular externamente."]
[null,null,"Contrato compra venta con cláusula:\nOBSERVACIÓN.- El comprador por medio del presente reconoce que sobre el vehículo materia del presente contrato se otorga garantía fiduciaria, en virtud de que el vehículo de manera simultánea a la compra ha sido aportado al FIDEICOMISO MERCANTIL DE GARANTÍA AUTOMOTRIZ DINERS CLUB - NO NEGOCIABLE."]
[null,null,"3 Copia de Cédula del Cónyuge (si aplica)"]
[null,null,"1 Voucher de compra con tarjeta de crédito."]
[null,null,"1 Nombramiento, cédula, y RUC del representante legal del Concesionario."]
[null,null,"1 Orden de instalación de dispositivo de rastreo Hunter de herramienta o documento de contratación de rastreto satelital."]
[null,"POR FAVOR ADJUNTE ESTE FORMULARIO A LOS CONTRATOS Y OTROS DOCUMENTOS ORIGINALES Y FIRMADOS QUE SE REMITE A DINERS CLUB."]

{"sheet":"CONOZCA A SU CLIENTE PN","index":18,"n_rows":8,"n_cols":1,"rows_kept":8,"cut":false,"hidden":false,"merged":[]}
[]
[]
[]
[]
[]
["Fomulario Conozca Su Cliente - Personas Naturales"]
[]
["Hacer click en el siguiente ícono:"]

{"sheet":"HUNTER","index":19,"n_rows":64,"n_cols":245,"rows_kept":64,"cut":false,"hidden":true,"merged":[[62,0,62,31],[36,0,36,31],[47,26,47,31],[63,0,63,31],[38,223,38,237],[39,0,39,7],[42,0,42,31],[43,0,43,31],[44,0,44,7],[44,8,44,11],[38,0,38,14],[38,63,38,77],[38,95,38,109],[38,127,38,141],[38,159,38,173],[38,191,38,205],[35,0,35,31],[33,210,33,211],[33,212,33,222],[33,223,33,235],[33,52,33,62],[45,0,45,31],[50,0,53,31],[54,0,57,31],[59,0,59,7],[37,223,37,254],[37,0,37,31],[37,63,37,94],[37,95,37,126],[37,127,37,158],[37,159,37,190],[37,191,37,222],[36,63,36,94],[36,95,36,126],[36,127,36,158],[36,159,36,190],[36,191,36,222],[36,223,36,254],[33,63,33,75],[33,76,33,78],[32,0,32,4],[32,5,32,7],[32,11,32,13],[33,44,33,46],[33,47,33,49],[33,50,33,51],[32,14,32,31],[33,13,33,31],[33,236,33,238],[33,140,33,142],[33,143,33,145],[33,146,33,147],[33,148,33,158],[33,159,33,171],[33,172,33,174],[33,175,33,177],[33,178,33,179],[33,180,33,190],[33,95,33,107],[33,108,33,110],[33,111,33,113],[33,114,33,115],[33,116,33,126],[33,127,33,139],[33,79,33,81],[33,82,33,83],[33,84,33,94],[30,211,30,222],[30,223,30,235],[30,236,30,242],[30,243,30,254],[30,204,30,210],[33,239,33,241],[33,242,33,243],[33,244,33,254],[33,191,33,203],[33,204,33,206],[33,207,33,209],[31,0,31,31],[30,140,30,146],[30,147,30,158],[30,159,30,171],[30,172,30,178],[30,179,30,190],[30,191,30,203],[30,76,30,82],[30,83,30,94],[30,95,30,107],[30,108,30,114],[30,115,30,126],[30,127,30,139],[30,0,30,13],[30,14,30,19],[30,44,30,50],[30,51,30,62],[30,63,30,75],[16,22,16,31],[19,0,21,31],[25,5,25,9],[25,21,25,25],[27,0,27,31],[28,0,28,10],[28,12,28,31],[18,0,18,2],[18,3,18,8],[18,9,18,12],[18,13,18,18],[18,19,18,21],[18,22,18,31],[11,0,11,4],[11,5,11,31],[12,0,12,4],[12,5,12,16],[12,17,12,20],[12,21,12,31],[34,0,34,10],[34,11,34,13],[34,14,34,31],[17,0,17,2],[17,3,17,8],[17,9,17,12],[17,13,17,18],[17,19,17,21],[17,22,17,31],[13,0,13,6],[13,7,13,31],[14,3,14,30],[15,0,15,31],[16,0,16,2],[16,3,16,8],[16,9,16,12],[16,13,16,18],[16,19,16,21],[0,0,0,31],[4,0,7,31],[8,0,8,31],[9,0,9,4],[9,5,9,14],[9,15,9,21],[9,22,9,31],[10,0,10,4],[10,5,10,31]]}
["PLAN EXCLUSIVO PARA SOCIOS DINERS CLUB"]
[]
[]
[]
["GUAYAQUIL :  Cdla. Vernaza Norte MZ 21 Solar 2,6,7 y 8 Telef.  ( 04) 2291065. QUITO : Av. 10 de Agosto 5023 y Los Cedros. Esq. PBX : (02) 805170-805180. TUMBACO : CC. Ventura Mall. Local 5 B. PBX : (02) 2375308. MACHALA : Marcel Laniado 105 y Circunvalación Norte. PBX : (07) 2980379. MANTA : Av. 113 y Calle 119 esq. PBX : (05) 2925584. QUEVEDO :   Malecón 302 y Tercera Esq. (05)2761370.  STO. DOMINGO : Av. Quevedo. Km. 3/12 No. 1516 y Av. Bombolí. AMBATO : Montalvo 0236 y Los Capulíes. PBX : 2829941.  LOJA: 24 de Mayo y Azuay. Esq. PBX : 2574291. CUENCA:  Circunvalación Sur y J. Núñez. PBX : (07) 2819080. IBARRA :  Av. Cristóbal de Troya 661 y J. M. Lequerica. PBX : (06) 2955517. SALINAS :  Calle Segunda ( Junto a Mi Comisariato Jr.) PBX : 2761370."]
[]
[]
[]
["ORDEN DE INSTALACIÓN DEL SISTEMA HUNTER "]
["FECHA:",null,null,null,null,{"$f":"FORM!F9","v":"2025-02-07"},null,null,null,null,null,null,null,null,null,"VALOR VEHICULO:",null,null,null,null,null,null,{"$f":"FORM!F101","v":10000}]
["NOMBRE:",null,null,null,null,{"$f":"FORM!Q38","v":"PRIMER NOMBRE SEGUNDO NOMBRE PRIMER APELLIDO SEGUNDO APELLIDO"}]
["DIRECCIÓN:",null,null,null,null,{"$f":"FORM!F46","v":"CARCELEN"}]
["TELEFONOS:",null,null,null,null,{"$f":"CONCATENATE(FORM!F38,\" \",FORM!L38)","v":"CELULAR CONVENCIONAL"},null,null,null,null,null,null,null,null,null,null,null,"CIUDAD:",null,null,null,{"$f":"+FORM!F26","v":"GUAYAQUIL"}]
["CONCESIONARIO:",null,null,null,null,null,null,{"$f":"+FORM!F14","v":"CONCESIONARIO"}]
["PLAN",null,null,{"$f":"+A34","v":"Con dispositivo Concesionario"}]
["DATOS DEL VEHICULO"]
["MARCA:",null,null,{"$f":"+FORM!F78","v":"HYUNDAI"},null,null,null,null,null,"MODELO:",null,null,null,{"$f":"+FORM!F80","v":"ACCENT"},null,null,null,null,null,"TIPO:",null,null,{"$f":"+FORM!F85","v":"SEDAN"}]
["COLOR:",null,null,{"$f":"+FORM!F89","v":"ROJO"},null,null,null,null,null,"AÑO:",null,null,null,{"$f":"+FORM!F87","v":"2022"},null,null,null,null,null,"PLACA:",null,null,"N/A"]
["MOTOR:",null,null,{"$f":"+FORM!F91","v":"BU456792826RE7"},null,null,null,null,null,"CHASIS:",null,null,null,{"$f":"+FORM!F93","v":"CG5342892U"},null,null,null,null,null,"USO:",null,null,"PERSONAL/FAMILIAR"]
["El asegurado deberá llevar el vehículo para la instalación del sistema Hunter, en un plazo de 8 días posteriores a la compra del vehículo. De no hacerlo, pierde el derecho a indemnización en el caso de un eventual robo total."]
[]
[]
[]
[]
[]
[null,null,null,null,null,"CONCESIONARIO",null,null,null,null,null,null,null,null,null,null,null,null,null,null,null,"TARJETAHABIENTE"]
[]
["AUTORIZACIÓN ORDEN DE CARGO"]
[{"$f":"+FORM!F26","v":"GUAYAQUIL"},null,null,null,null,null,null,null,null,null,null,",",{"$f":"+F10","v":"2025-02-07"}]
[]
["En mi calidad de socio Diners Club No.",null,null,null,null,null,null,null,null,null,null,null,null,null,{"$f":"CONCATENATE(FORM!F151,FORM!L151)","v":"3608601234567890"},null,null,null,null,null,null,null,"autorizo  libre y  voluntariamente",null,null,null,null,null,null,null,null,null,null,null,null,null,null,null,null,null,null,null,null,null,{"$f":"CONCATENATE([7]FORM!AL147,[7]FORM!AR147)","v":""},null,null,null,null,null,null,"autorizo libre y voluntariamente a ",null,null,null,null,null,null,null,null,null,null,null,"En mi calidad de socio Diners Club No.",null,null,null,null,null,null,null,null,null,null,null,null,{"$f":"CONCATENATE([7]FORM!BR147,[7]FORM!BX147)","v":""},null,null,null,null,null,null,"autorizo libre y voluntariamente a ",null,null,null,null,null,null,null,null,null,null,null,"En mi calidad de socio Diners Club No.",null,null,null,null,null,null,null,null,null,null,null,null,{"$f":"CONCATENATE([7]FORM!CX147,[7]FORM!DD147)","v":""},null,null,null,null,null,null,"autorizo libre y voluntariamente a ",null,null,null,null,null,null,null,null,null,null,null,"En mi calidad de socio Diners Club No.",null,null,null,null,null,null,null,null,null,null,null,null,{"$f":"CONCATENATE([7]FORM!ED147,[7]FORM!EJ147)","v":""},null,null,null,null,null,null,"autorizo libre y voluntariamente a ",null,null,null,null,null,null,null,null,null,null,null,"En mi calidad de socio Diners Club No.",null,null,null,null,null,null,null,null,null,null,null,null,{"$f":"CONCATENATE([7]FORM!FJ147,[7]FORM!FP147)","v":""},null,null,null,null,null,null,"autorizo libre y voluntariamente a ",null,null,null,null,null,null,null,null,null,null,null,"En mi calidad de socio Diners Club No.",null,null,null,null,null,null,null,null,null,null,null,null,{"$f":"CONCATENATE([7]FORM!GP147,[7]FORM!GV147)","v":""},null,null,null,null,null,null,"autorizo libre y voluntariamente a ",null,null,null,null,null,null,null,null,null,null,null,"En mi calidad de socio Diners Club No.",null,null,null,null,null,null,null,null,null,null,null,null,{"$f":"CONCATENATE([7]FORM!HV147,[7]FORM!IB147)","v":""},null,null,null,null,null,null,"autorizo libre y voluntariamente a "]
["a BANCO DINERS CLUB DEL ECUADOR S.A., se cargue a mi señalada tarjeta de manera mensual el"]
["valor de US$",null,null,null,null,{"$f":"+FORM!F139","v":0},null,null,"durante",null,null,{"$f":"+FORM!F105","v":24},null,null,"meses, que  corresponde  a  la  compra  de  un  sistema"]
[{"$f":"+FORM!F113","v":"Con dispositivo Concesionario"},null,null,null,null,null,null,null,null,null,null,null,null,"de  conformidad  al  acuerdo que he llegado con CARSEG S.A.",null,null,null,null,null,null,null,null,null,null,null,null,null,null,null,null,null,null,null,null,null,null,null,null,null,null,null,null,null,null,null,null,null,"durante",null,null,{"$f":"+[7]FORM!AL107*12","v":0},null,"meses, que corresponde a la ",null,null,null,null,null,null,null,null,null,null,"de manera mensual el valor de US$",null,null,null,null,null,null,null,null,null,null,null,null,null,null,null,"durante",null,null,{"$f":"+[7]FORM!BR107*12","v":0},null,"meses, que corresponde a la ",null,null,null,null,null,null,null,null,null,null,"de manera mensual el valor de US$",null,null,null,null,null,null,null,null,null,null,null,null,null,null,null,"durante",null,null,{"$f":"+[7]FORM!CX107*12","v":0},null,"meses, que corresponde a la ",null,null,null,null,null,null,null,null,null,null,"de manera mensual el valor de US$",null,null,null,null,null,null,null,null,null,null,null,null,null,null,null,"durante",null,null,{"$f":"+[7]FORM!ED107*12","v":0},null,"meses, que corresponde a la ",null,null,null,null,null,null,null,null,null,null,"de manera mensual el valor de US$",null,null,null,null,null,null,null,null,null,null,null,null,null,null,null,"durante",null,null,{"$f":"+[7]FORM!FJ107*12","v":0},null,"meses, que corresponde a la ",null,null,null,null,null,null,null,null,null,null,"de manera mensual el valor de US$",null,null,null,null,null,null,null,null,null,null,null,null,null,null,null,"durante",null,null,{"$f":"+[7]FORM!GP107*12","v":0},null,"meses, que corresponde a la ",null,null,null,null,null,null,null,null,null,null,"de manera mensual el valor de US$",null,null,null,null,null,null,null,null,null,null,null,null,null,null,null,"durante",null,null,{"$f":"+[7]FORM!HV107*12","v":0},null,"meses, que corresponde a la "]
["esto es, un crédito diferido a",null,null,null,null,null,null,null,null,null,null,{"$f":"+L33","v":24},null,null,"meses plazo sin intereses, valores que me comprometo a"]
["cancelar de manera incondicional y dentro de los plazos estipulados."]
["Asímismo, expresamente me obligo a no revocar la presente autorización, sin previo consentimiento por escrito de CARSEG S.A, por lo que libero de toda responsabilidad a BANCO DINERS CLUB DEL ECUADOR S.A. por los cargos efectuados en base a la presente autorización.",null,null,null,null,null,null,null,null,null,null,null,null,null,null,null,null,null,null,null,null,null,null,null,null,null,null,null,null,null,null,null,null,null,null,null,null,null,null,null,null,null,null,null,null,null,null,null,null,null,null,null,null,null,null,null,null,null,null,null,null,null,null,"Asímismo, expresamente me obligo a no revocar la presente autorización, sin previo consentimiento por ",null,null,null,null,null,null,null,null,null,null,null,null,null,null,null,null,null,null,null,null,null,null,null,null,null,null,null,null,null,null,null,"Asímismo, expresamente me obligo a no revocar la presente autorización, sin previo consentimiento por ",null,null,null,null,null,null,null,null,null,null,null,null,null,null,null,null,null,null,null,null,null,null,null,null,null,null,null,null,null,null,null,"Asímismo, expresamente me obligo a no revocar la presente autorización, sin previo consentimiento por ",null,null,null,null,null,null,null,null,null,null,null,null,null,null,null,null,null,null,null,null,null,null,null,null,null,null,null,null,null,null,null,"Asímismo, expresamente me obligo a no revocar la presente autorización, sin previo consentimiento por ",null,null,null,null,null,null,null,null,null,null,null,null,null,null,null,null,null,null,null,null,null,null,null,null,null,null,null,null,null,null,null,"Asímismo, expresamente me obligo a no revocar la presente autorización, sin previo consentimiento por ",null,null,null,null,null,null,null,null,null,null,null,null,null,null,null,null,null,null,null,null,null,null,null,null,null,null,null,null,null,null,null,"Asímismo, expresamente me obligo a no revocar la presente autorización, sin previo consentimiento por "]
["De igual manera,  autorizo en caso de pérdida,  hurto,  robo o cualquier otra circunstancia que merezca ser cambiado mi actual número de tarjeta,   se  cuenta  con el nuevo que se me  asigne  para  cancelar todos mis consumos de manera incondicional dentro del periodo respectivo,  de  tal  forma  de  que mis obligaciones no queden en mora por los conceptos antes mencionados y hasta su total cancelación.",null,null,null,null,null,null,null,null,null,null,null,null,null,null,null,null,null,null,null,null,null,null,null,null,null,null,null,null,null,null,null,null,null,null,null,null,null,null,null,null,null,null,null,null,null,null,null,null,null,null,null,null,null,null,null,null,null,null,null,null,null,null,"De igual manera,  autorizo en caso de pérdida,  hurto,  robo o cualquier otra circunstancia que merezca ",null,null,null,null,null,null,null,null,null,null,null,null,null,null,null,null,null,null,null,null,null,null,null,null,null,null,null,null,null,null,null,"De igual manera,  autorizo en caso de pérdida,  hurto,  robo o cualquier otra circunstancia que merezca ",null,null,null,null,null,null,null,null,null,null,null,null,null,null,null,null,null,null,null,null,null,null,null,null,null,null,null,null,null,null,null,"De igual manera,  autorizo en caso de pérdida,  hurto,  robo o cualquier otra circunstancia que merezca ",null,null,null,null,null,null,null,null,null,null,null,null,null,null,null,null,null,null,null,null,null,null,null,null,null,null,null,null,null,null,null,"De igual manera,  autorizo en caso de pérdida,  hurto,  robo o cualquier otra circunstancia que merezca ",null,null,null,null,null,null,null,null,null,null,null,null,null,null,null,null,null,null,null,null,null,null,null,null,null,null,null,null,null,null,null,"De igual manera,  autorizo en caso de pérdida,  hurto,  robo o cualquier otra circunstancia que merezca ",null,null,null,null,null,null,null,null,null,null,null,null,null,null,null,null,null,null,null,null,null,null,null,null,null,null,null,null,null,null,null,"De igual manera,  autorizo en caso de pérdida,  hurto,  robo o cualquier otra circunstancia que merezca "]
[null,null,null,null,null,null,null,null,null,null,null,null,null,null,null,null,null,null,null,null,null,null,null,null,null,null,null,null,null,null,null,null,null,null,null,null,null,null,null,null,null,null,null,null,null,null,null,null,null,null,null,null,null,null,null,null,null,null,null,null,null,null,null,"hasta su total cancelación.",null,null,null,null,null,null,null,null,null,null,null,null,null,null,null,null,null,null,null,null,null,null,null,null,null,null,null,null,null,null,null,"hasta su total cancelación.",null,null,null,null,null,null,null,null,null,null,null,null,null,null,null,null,null,null,null,null,null,null,null,null,null,null,null,null,null,null,null,"hasta su total cancelación.",null,null,null,null,null,null,null,null,null,null,null,null,null,null,null,null,null,null,null,null,null,null,null,null,null,null,null,null,null,null,null,"hasta su total cancelación.",null,null,null,null,null,null,null,null,null,null,null,null,null,null,null,null,null,null,null,null,null,null,null,null,null,null,null,null,null,null,null,"hasta su total cancelación.",null,null,null,null,null,null,null,null,null,null,null,null,null,null,null,null,null,null,null,null,null,null,null,null,null,null,null,null,null,null,null,"hasta su total cancelación."]
["Atentamente,"]
[]
[]
[{"$f":"+F11","v":"PRIMER NOMBRE SEGUNDO NOMBRE PRIMER APELLIDO SEGUNDO APELLIDO"}]
[{"$f":"+FORM!F40","v":"XXXXXXXXXX"}]
["Caducidad Tarjeta:",null,null,null,null,null,null,null,{"$f":"+FORM!F153","v":"2023-07-01"}]
["DECLARACION ADICIONAL"]
[]
[{"$f":"A43","v":"PRIMER NOMBRE SEGUNDO NOMBRE PRIMER APELLIDO SEGUNDO APELLIDO"},null,null,null,null,null,null,null,null,null,null,null,null,null,null,", mayor de edad, de estado civil",null,null,null,null,null,null,null,null,null,null,{"$f":"+IF(FORM!F64<>\"\",\"CASADO\",\"SOLTERO\")","v":"SOLTERO"}]
[", portador de la cédula de ciudadanía o pasaporte No.",null,null,null,null,null,null,null,null,null,null,null,null,null,null,null,null,null,null,{"$f":"+A44","v":"XXXXXXXXXX"},null,null,null,", por medio de la presente"]
["realizo la siguiente declaración:"]
["Declaro de manera expresa que autorizo a la compañía CARSEG S.A,  para que en el evento de que la compañía Banco Diners Club del Ecuador S.A., lo requiera, haga conocer la información en relación a la ubicación del vehículo, así mismo podrá bloquear el vehículo a la sola solicitud de Banco Diners Club del Ecuador S.A."]
[]
[]
[]
["Por tratarse de una autorización realizada de manera libre y voluntaria, declaro que no interpondré contra Banco Diners Club del Ecuador S.A., o la compañía Hunter, ningún tipo de acción judicial o administrativa  por la ejecución de las acciones descritas en el presente documento."]
[]
[]
[]
[]
["Atentamente,"]
[]
[]
[{"$f":"A43","v":"PRIMER NOMBRE SEGUNDO NOMBRE PRIMER APELLIDO SEGUNDO APELLIDO"}]
[{"$f":"A44","v":"XXXXXXXXXX"}]

{"sheet":"AUTOCERTIFICACIÓN PJ","index":20,"n_rows":8,"n_cols":1,"rows_kept":8,"cut":false,"hidden":true,"merged":[]}
[]
[]
[]
[]
[]
["Formulario Autocertificación de Residencia Fiscal Para Personas Que Ejercen el Control"]
[]
["Hacer click en el siguiente ícono:"]

{"sheet":"AUTOCERTIFICACIÓN","index":21,"n_rows":94,"n_cols":14,"rows_kept":94,"cut":false,"hidden":true,"merged":[[3,0,3,14],[4,0,4,14],[6,0,6,14],[7,0,7,14],[9,0,9,14],[10,0,10,5],[10,6,10,8],[10,9,10,11],[10,12,10,14],[14,0,14,14],[15,0,15,7],[15,8,15,14],[16,0,16,14],[17,0,17,4],[17,5,17,9],[17,10,17,14],[11,0,11,5],[11,6,11,8],[11,9,11,11],[11,12,11,14],[12,0,12,14],[13,0,13,2],[13,3,13,6],[13,7,13,10],[13,11,13,14],[22,0,22,6],[22,7,22,10],[22,11,22,14],[23,0,23,6],[23,7,23,10],[23,11,23,14],[18,0,18,14],[19,0,19,4],[19,5,19,9],[19,10,19,14],[20,0,20,14],[21,0,21,14],[26,0,26,14],[27,0,27,1],[27,2,27,14],[28,0,28,1],[28,2,28,14],[29,0,29,1],[29,2,29,14],[24,0,24,6],[24,7,24,10],[24,11,24,14],[25,0,25,6],[25,7,25,10],[25,11,25,14],[33,0,33,1],[33,2,33,14],[34,0,34,1],[34,2,34,14],[35,0,35,1],[35,2,35,14],[30,0,30,1],[30,2,30,14],[31,0,31,1],[31,2,31,14],[32,0,32,1],[32,2,32,14],[39,0,39,1],[39,2,39,14],[41,1,41,14],[49,0,49,14],[50,0,50,14],[53,2,53,6],[53,9,53,13],[36,0,36,1],[36,2,36,14],[37,0,37,1],[37,2,37,14],[38,0,38,1],[38,2,38,14],[63,0,63,14],[64,0,64,14],[65,0,65,2],[65,3,65,4],[65,6,65,8],[65,9,65,11],[65,12,65,14],[56,2,56,6],[56,9,56,13],[58,2,58,12],[60,0,60,14],[61,0,61,14],[62,0,62,14],[68,0,68,14],[69,0,69,14],[93,1,93,14],[66,0,66,2],[66,3,66,4],[66,6,66,8],[66,9,66,11],[66,12,66,14],[67,0,67,2],[67,3,67,4],[67,6,67,8],[67,9,67,11],[67,12,67,14]]}
[]
[]
[null,null,null,null,null,null,null,null,null,null,null,null,null,"FDV - 010"]
["AUTO – CERTIFICACIÓN DE RESIDENCIA FISCAL PARA PERSONAS QUE EJERCEN EL CONTROL"]
["Conforme a las regulaciones del Estándar Común de Reporte (CRS por sus siglas en ingles) en el marco de la OCDE (Organización para la Cooperación y Desarrollo Económico), lo establecido en la Disposición General Primera de la Ley Orgánica para la Reactivación de la Economía, Fortalecimiento de la  Dolarización  y Modernización de la Gestión, publicada en el Suplemento del Registro Oficial No. 150 de 29 de diciembre de 2017 y según lo señalado en la Resolución NAC- DGERCGC19-000000045 del Servicio de Rentas Internas, publicada en el Suplemento del Registro Oficial Nro. 51 de 01 de octubre de 2019, se ha dispuesto la obligación de reportar información específica sobre la residencia fiscal de una cuenta. Con el objeto de dar  cumplimiento con la normativa expuesta, se ha implementado el presente formulario de auto- certificación a fin de que los datos registrados en el mismo, sean transmitidos al Servicio de Rentas Internas que a su vez podrá enviar esta información a las autoridades fiscales de otras jurisdicciones en virtud de acuerdos intergubernamentales para intercambiar información de cuentas financieras."]
["¿Quién debe llenar este formulario?"]
[" El titular de la cuenta que sea una Entidad No Financiera (ENF) Pasiva o una Entidad de Inversión residente en el exterior y administrada por otra Institución Financiera."]
[" No llene este formulario si representa a una sociedad distinta a una Entidad No Financiera (ENF) Pasiva o una Entidad de Inversión, en su lugar debe presentar el Formulario de Auto – certificación de Residencia Fiscal para persona jurídicas."]
[" Use un formulario separado para cada persona que ejerce el control."]
["1.    IDENTIFICACIÓN DE LA PERSONA QUE EJERCE EL CONTROL (mayor o igual al 25%)"]
["Nombres y Apellidos completos",null,null,null,null,null,"Fecha de nacimiento (aa/mm/dd)",null,null,"Ciudad de nacimiento",null,null,"País de nacimiento"]
[]
["Dirección permanente de residencia (calle, número, piso, departamento, referencia de ubicación):"]
["Ciudad:",null,null,"Provincia:",null,null,null,"País:",null,null,null,"Código postal:"]
["2.    RESIDENCIA FISCAL DE LA PERSONA QUE EJERCE EL CONTROL"]
["1. ¿Es una persona estadounidense para fines fiscales (paga impuestos en EE.UU.) ?: SI (      ) NO (      )",null,null,null,null,null,null,null,"Si respondió SI, indique su número de identificación como contribuyente en Estados Unidos:"]
["2. ¿Es residente de cualquier otro país distinto de Estados Unidos y Ecuador para fines fiscales (país donde paga impuestos) ?: SI (        ) NO (        ). Si la respuesta es positiva por favor a continuación enumere el/los países:"]
["1)",null,null,null,null,"2)",null,null,null,null,"3)"]
["Proporcione a continuación el número de identificación fiscal (NIF) del contribuyente para cada país que indicó anteriormente:"]
["1)",null,null,null,null,"2)",null,null,null,null,"3)"]
["3.    TIPO DE PERSONA QUE EJERCE EL CONTROL"]
["Datos de las sociedades de las cuales ejerce el control:"]
["Razón Social",null,null,null,null,null,null,"Número de Identificación Fiscal (NIF)",null,null,null,"Status de la persona que ejerce el                                                                                                                                                                                                                                                                                                     control (*)"]
["1)"]
["2)"]
["3)"]
["Estatus de la persona que ejerce el control (*)"]
["CRS801",null,"Persona que ejerce el control de la persona jurídica – control por propiedad."]
["CRS802",null,"CP of legal person - other means (Persona que ejerce el control de una entidad– control por otros medios)."]
["CRS803",null,"Persona que ejerce el control de la persona jurídica – por cargo directivo."]
["CRS804",null,"Persona que ejerce el control de la persona jurídica – fideicomiso - fideicomitente."]
["CRS805",null,"Persona que ejerce el control de la persona jurídica – fideicomiso - fiduciario."]
["CRS806",null,"CP of legal arrangement - trust – protector (Persona que ejerce el control de un fideicomiso – protector)."]
["CRS807",null,"Persona que ejerce el control de la persona jurídica – fideicomiso – beneficiario."]
["CRS808",null,"CP of legal arrangement - trust – other (Persona que ejerce el control de un fideicomiso – otro)."]
["CRS809",null,"CP of legal arrangement - other – settlor-equivalent (Persona que ejerce el control de un acuerdo jurídico)."]
["CRS810",null,"CP of legal arrangement - other – trustee-equivalent (Persona que ejerce el control de un acuerdo jurídico(excepto fideicomiso)– fiduciario o equivalente)."]
["CRS811",null,"CP of legal arrangement - other – protector-equivalent (Persona que ejerce el control de un arreglo jurídico(excepto fideicomiso)– protector o equivalente)."]
["CRS812",null,"CP of legal arrangement - other – beneficiary-equivalent (Persona que ejerce el control de un acuerdo jurídico(excepto fideicomiso)– beneficiario o equivalente)."]
["CRS813",null,"CP of legal arrangement - other – other-equivalent (. Persona que ejerce el control de un acuerdo jurídico(excepto fideicomiso)– otro-equivalente)."]
[]
[null,1]
[]
[]
[]
[]
[]
[]
[null,null,null,null,null,null,null,null,null,null,null,null,null,"FDV - 010"]
["4.    CERTIFICACIÓN Y COMPROMISO"]
["Por este medio certifico que la información proporcionada en este formulario es correcta y completa.\n Autorizo a FIDEVAL S.A. a proporcionar, directa o indirectamente, la información contenida en este formulario y/o una copia de este formulario a cualquier autoridad fiscal pertinente o cualquier parte autorizada para auditar o realizar un control similar de FIDEVAL S.A. para fines fiscales, así como a divulgar a tales autoridades fiscales o tal parte cualquier información adicional que pudiese poseer FIDEVAL S.A. y que es pertinente para mi calificación para cualquier beneficio reclamado con base en esta certificación.\n Acepto que la información contenida en este formulario y la información relacionada con mis cuentas en FIDEVAL S.A. (incluso la información sobre los saldos de cuentas y pagos recibidos) se notifique a las autoridades fiscales pertinentes, y que estas autoridades proporcionen esta información a cualquier otro país enumerado en la lista anterior como a un país en el cual soy residente para fines fiscales.\n Me comprometo a avisar inmediatamente a FIDEVAL S.A. sobre cualquier cambio en las circunstancias que motive que la información contenida en este documento sea incorrecta y a proporcionar a FIDEVAL S.A. un formulario actualizado y apropiado de auto-certificación de residencia fiscal en un plazo de 30 días  a partir de la fecha del cambio en las circunstancias."]
[]
[]
[null,null,"Firma ",null,null,null,null,null,null,"Ciudad y Fecha (aa/mm/dd)"]
[]
[]
[null,null,"Identificación",null,null,null,null,null,null,"Nombre del firmante"]
[]
[null,null,"Calidad en la que funge el firmante (si el formulario no es firmado por la persona que ejerce el control)"]
[]
["5.     PARA USO EXCLUSIVO FIDEVAL S.A."]
["Nombre y cargo de quien recibe la información:_____________________________________________________     Fecha: _________________________"]
["Firma del Responsable: ________________________________________________________________________"]
["Declaro que la información y documentación receptada se encuentra de forma correcta y completa, a la fecha de entrega del presente formulario."]
["6.      VERIFICACIÓN DE DATOS"]
["DETALLE",null,null,"SI",null,"NO","DETALLE",null,null,"SI",null,null,"NO"]
["Identificación:",null,null,null,null,null,"Direcciones:"]
["Validación Listas de Observados:",null,null,null,null,null,"Firma:"]
["Fecha de ingreso de datos en el sistema:"]
["   OBSERVACIONES:"]
[]
[]
[]
[]
[]
[]
[]
[]
[]
[]
[]
[]
[]
[]
[]
[]
[]
[]
[]
[]
[]
[]
[]
[null,2]

{"sheet":"CONOZCA A SU CLIENTE PN(2)","index":22,"n_rows":127,"n_cols":28,"rows_kept":127,"cut":false,"hidden":true,"merged":[[120,0,120,27],[126,0,126,27],[118,1,118,7],[118,8,118,12],[118,13,118,17],[118,18,118,22],[118,23,118,27],[119,0,119,12],[119,13,119,17],[119,18,119,22],[119,23,119,27],[116,1,116,7],[116,8,116,12],[116,13,116,17],[116,18,116,22],[116,23,116,27],[117,1,117,7],[117,8,117,12],[117,13,117,17],[117,18,117,22],[117,23,117,27],[113,0,113,27],[114,0,114,27],[115,1,115,7],[115,8,115,12],[115,13,115,17],[115,18,115,22],[115,23,115,27],[101,0,101,27],[104,1,104,7],[104,15,104,23],[107,1,107,7],[107,15,107,23],[112,0,112,27],[82,0,82,27],[96,0,96,27],[97,0,97,27],[98,0,98,27],[99,0,99,27],[100,0,100,27],[76,0,76,2],[76,3,76,8],[76,9,76,12],[76,13,76,20],[76,21,76,24],[76,25,76,27],[75,0,75,2],[75,3,75,8],[75,9,75,12],[75,13,75,20],[75,21,75,24],[75,25,75,27],[72,0,72,27],[73,0,73,12],[73,13,73,27],[74,0,74,2],[74,3,74,8],[74,9,74,12],[74,13,74,20],[74,21,74,24],[74,25,74,27],[71,1,71,8],[71,9,71,13],[71,14,71,17],[71,18,71,21],[71,22,71,25],[71,26,71,27],[69,26,69,27],[70,1,70,8],[70,9,70,13],[70,14,70,17],[70,18,70,21],[70,22,70,25],[70,26,70,27],[67,0,67,1],[67,2,67,10],[67,11,67,22],[67,23,67,27],[68,0,68,27],[69,1,69,8],[69,9,69,13],[69,14,69,17],[69,18,69,21],[69,22,69,25],[64,0,64,27],[65,2,65,10],[65,11,65,22],[65,23,65,27],[66,0,66,1],[66,2,66,10],[66,11,66,22],[66,23,66,27],[62,0,62,7],[62,8,62,13],[62,14,62,23],[62,24,62,27],[63,0,63,7],[63,8,63,13],[63,14,63,23],[63,24,63,27],[60,0,60,7],[60,8,60,13],[60,14,60,23],[60,24,60,27],[61,0,61,7],[61,8,61,13],[61,14,61,23],[61,24,61,27],[58,0,58,7],[58,8,58,13],[58,14,58,23],[58,24,58,27],[59,0,59,13],[59,14,59,27],[56,0,56,7],[56,8,56,13],[56,14,56,23],[56,24,56,27],[57,0,57,7],[57,8,57,13],[57,14,57,23],[57,24,57,27],[54,0,54,7],[54,8,54,13],[54,14,54,23],[54,24,54,27],[55,0,55,7],[55,8,55,13],[55,14,55,23],[55,24,55,27],[51,0,51,27],[52,0,52,13],[52,14,52,27],[53,0,53,7],[53,8,53,13],[53,14,53,23],[53,24,53,27],[48,3,48,11],[48,12,48,16],[48,17,48,23],[48,24,48,27],[49,0,49,2],[49,3,49,11],[49,12,49,16],[49,17,49,23],[49,24,49,27],[45,28,50,29],[46,0,46,2],[46,3,46,11],[46,12,46,16],[46,17,46,27],[47,0,47,2],[47,3,47,11],[47,12,47,16],[47,17,47,27],[48,0,48,2],[50,0,50,27],[31,0,31,13],[31,14,31,27],[32,0,32,18],[32,19,32,27],[34,0,34,27],[45,0,45,27],[28,0,28,27],[29,0,29,3],[29,4,29,18],[29,19,29,22],[29,23,29,27],[30,0,30,3],[30,4,30,27],[24,0,24,27],[25,0,25,6],[25,7,25,18],[25,19,25,27],[26,0,26,27],[27,0,27,27],[21,0,21,13],[21,14,21,27],[22,0,22,27],[23,0,23,6],[23,7,23,18],[23,19,23,27],[19,0,19,6],[19,7,19,18],[19,19,19,27],[20,0,20,3],[20,4,20,13],[20,14,20,20],[20,21,20,27],[13,0,13,27],[14,0,14,27],[15,0,15,27],[16,0,16,27],[17,0,17,27],[18,0,18,6],[18,7,18,18],[18,19,18,27],[12,0,12,9],[12,10,12,16],[12,17,12,23],[12,24,12,27],[9,0,9,4],[9,5,9,16],[9,17,9,27],[10,0,10,4],[10,5,10,16],[10,17,10,27],[5,0,5,27],[6,0,6,27],[7,0,7,27],[8,0,8,4],[8,5,8,16],[8,17,8,27],[11,0,11,9],[11,10,11,16],[11,17,11,27]]}
[]
[]
[]
[]
[null,null,null,null,null,null,null,null,null,null,null,null,null,null,null,null,null,null,null,null,null,null,null,null,null,null,null,"FDV - 001"]
["FORMULARIO CONOZCA SU CLIENTE – PERSONAS NATURALES"]
["En cumplimiento a lo establecido en la Ley Orgánica de Prevención, Detección y Erradicación del Delito de Lavado de Activos y del Financiamiento de Delitos, su Reglamento General, Codificación de Resoluciones Monetarias Financieras, de Valores y Seguros, Resolución NAC-DGERCGC19-00000045 del Servicio de Rentas Internas, Políticas Internas de Prevención de Lavado de Activos y la Ley Foreign Account Tax Compliance Act (FATCA), se requiere la entrega de la siguiente información (favor completar todos los campos obligatoriamente)."]
["1.    INFORMACIÓN DEL CLIENTE"]
["Primer apellido",null,null,null,null,"Segundo apellido",null,null,null,null,null,null,null,null,null,null,null,"Nombres completos"]
[]
["Identificación:  Cédula:",null,null,null,null,"RUC :",null,null,null,null,null,null,null,null,null,null,null,"Pasaporte:"]
["Lugar y Fecha de nacimiento (aa/mm/dd)",null,null,null,null,null,null,null,null,null,"Nacionalidad",null,null,null,null,null,null,"Sexo"]
[null,null,null,null,null,null,null,null,null,null,null,null,null,null,null,null,null,"Masculino (      )",null,null,null,null,null,null,"Femenino (       )"]
["Estado civil:"]
["Soltero(a)  (      )             Casado(a)  (      )             Divorciado(a)  (    _)                Viudo(a)  (      )               Unión de Hecho (      )"]
["2.    AUTO – CERTIFICACIÓN DE RESIDENCIA FISCAL DEL CLIENTE"]
["Conforme a las regulaciones del Estándar Común de Reporte (CRS por sus siglas en ingles) en el marco de la OCDE (Organización para la Cooperación y Desarrollo Económico). Lo establecido en la Disposición General Primera de la Ley Orgánica para la Reactivación de la Economía, Fortalecimiento de la Dolarización y Modernización de la Gestión, publicada en el Suplemento del Registro Oficial No. 150 de 29 de diciembre de 2017 y según lo señalado en la Resolución NAC-DGERCGC19-000000045 del Servicio de Rentas Internas publicada en el Suplemento del Registro Oficial Nro. 51 de 01 de octubre de 2019, se ha dispuesto la obligación de reportar información específica sobre la residencia fiscal de una cuenta. Con el objeto de dar cumplimiento con la normativa expuesta, se incluye en este documento la auto- certificación de su Residencia Fiscal a fin de que los datos aquí registrados, sean transmitidos al Servicio de Rentas Internas que a su vez podrá enviar esta información a las autoridades fiscales de otras jurisdicciones, en virtud de acuerdos intergubernamentales para intercambiar información de cuentas financieras."]
["Dirección permanente de residencia (calle, numero, piso, departamento, referencia de ubicación):"]
["Ciudad:",null,null,null,null,null,null,"Provincia:",null,null,null,null,null,null,null,null,null,null,null,"Cantón:"]
["Parroquia:",null,null,null,null,null,null,"País:",null,null,null,null,null,null,null,null,null,null,null,"Código postal:"]
["E -mail personal:",null,null,null,"E - mail laboral:",null,null,null,null,null,null,null,null,null,"Tfno. domicilio:",null,null,null,null,null,null,"Tfno. celular:"]
["¿Es una persona estadounidense para fines fiscales (paga impuestos en EEUU)?\nSI (      ) NO (      )",null,null,null,null,null,null,null,null,null,null,null,null,null,"Si marcó SI, indique su número de identificación de contribuyente en Estados Unidos:"]
["¿Es residente de cualquier otro país distinto de Estados Unidos y Ecuador para fines fiscales (país donde paga impuestos) ?: SI (      ) NO (      ). Si la respuesta es positiva por favor enumere el/los países en donde es residente (donde paga impuestos):"]
["1)",null,null,null,null,null,null,"2)",null,null,null,null,null,null,null,null,null,null,null,"3)"]
["Proporcione a continuación el número de identificación de contribuyente para cada país que indicó anteriormente:"]
["1)",null,null,null,null,null,null,"2)",null,null,null,null,null,null,null,null,null,null,null,"3)"]
["Certifico que la información proporcionada en este formulario es correcta y completa.\n Autorizo a FIDEVAL S.A. a proporcionar, directa o indirectamente, la Información contenida en este documento y/o una copia de este formulario a cualquier autoridad fiscal pertinente o cualquier parte autorizada para auditar o realizar un control similar de FIDEVAL S.A. para fines fiscales, así como a divulgar a tales autoridades fiscales o tal parte cualquier información adicional que pudiese poseer FIDEVAL S.A. y que es pertinente para mi calificación para cualquier beneficio reclamado con base en esta certificación.\n Acepto que la información contenida en este formulario y la información relacionada con mis cuentas en FIDEVAL S.A. (incluso la información sobre los saldos de cuentas y pagos recibidos) se notifique a las autoridades fiscales pertinentes, y que estas autoridades proporcionen esta información a cualquier otro país enumerado en la lista anterior como a un país en el cual soy residente para fines fiscales.\n Me comprometo a avisar inmediatamente a FIDEVAL S.A. sobre cualquier cambio en las circunstancias que motive que la información contenida en este documento sea incorrecta y a proporcionar a FIDEVAL S.A. un formulario actualizado y apropiado de Auto-Certificación de Residencia Fiscal en un plazo de 30 días a partir de la fecha del cambio en las circunstancias."]
["3.    ACTIVIDAD ECONÓMICA (Si el cliente es menor de edad entregar datos del Representante Legal y/o Apoderado)"]
["Detalle de la Profesión/Ocupación / Actividad Económica Principal:"]
["Nombre de la empresa donde trabaja:",null,null,null,"Cargo que ocupa:",null,null,null,null,null,null,null,null,null,null,null,null,null,null,"Años en el cargo:",null,null,null,"Teléfono trabajo:"]
[null,null,null,null,"Dirección del trabajo:"]
["Actividad Económica Secundaria:   SI (      )    NO (      )",null,null,null,null,null,null,null,null,null,null,null,null,null,"Tiempo que la ejerce:"]
["Detallar actividad si su respuesta fue positiva:",null,null,null,null,null,null,null,null,null,null,null,null,null,null,null,null,null,null,"Ciudad y Dirección:"]
[]
[1]
[]
[]
[]
[]
[]
[]
[]
[]
[null,null,null,null,null,null,null,null,null,null,null,null,null,null,null,null,null,null,null,null,null,null,null,null,null,null,null,"FDV - 001"]
[]
["4.    INFORMACIÓN DEL CÓNYUGE Y/O REPRESENTANTE LEGAL /APODERADO"]
["CÓNYUGE: Nombres Completos",null,null,"Número de identificación / Pasaporte",null,null,null,null,null,null,null,null,"Nacionalidad",null,null,null,null,"Actividad Económica"]
[]
["REP. LEGAL/APODERADO:\nNombres Completos",null,null,"Número de identificación / Pasaporte",null,null,null,null,null,null,null,null,"Nacionalidad",null,null,null,null,"Dirección domicilio",null,null,null,null,null,null,"Teléfono domicilio/  celular"]
[]
["Número y fecha de la escritura pública del poder respectivo (en caso de Apoderado):"]
["5.     ESTADO DE SITUACIÓN FINANCIERA (Si el cliente es menor de edad entregar datos del Representante Legal y/o Apoderado)"]
["ACTIVOS",null,null,null,null,null,null,null,null,null,null,null,null,null,"PASIVOS"]
["Detalle",null,null,null,null,null,null,null,"Valor",null,null,null,null,null,"Detalle",null,null,null,null,null,null,null,null,null,"Valor"]
["Efectivo en bancos a la fecha del formulario",null,null,null,null,null,null,null,null,null,null,null,null,null,"Créditos hipotecarios/ quirografarios/prendarios"]
["Inversiones / Acciones / Participaciones/ Inventarios/Cuentas por Cobrar",null,null,null,null,null,null,null,null,null,null,null,null,null,"Deuda total en tarjetas de crédito"]
["Bienes Inmuebles",null,null,null,null,null,null,null,null,null,null,null,null,null,"Otras cuentas por pagar"]
["Bienes Muebles / Vehículos / Maquinaria",null,null,null,null,null,null,null,null,null,null,null,null,null,"TOTAL PASIVOS"]
["TOTAL ACTIVOS",null,null,null,null,null,null,null,null,null,null,null,null,null,"TOTAL PATRIMONIO (activos menos pasivos)"]
["INGRESOS MENSUALES",null,null,null,null,null,null,null,null,null,null,null,null,null,"GASTOS MENSUALES"]
["Ingreso de la actividad económica principal",null,null,null,null,null,null,null,null,null,null,null,null,null,"Gasto vivienda"]
["Ingreso de la actividad económica secundaria",null,null,null,null,null,null,null,null,null,null,null,null,null,"Gasto alimentación / servicios básicos / educación / pago tarjetas de crédito"]
["Otros ingresos (describa):                                                                          ",null,null,null,null,null,null,null,null,null,null,null,null,null,"Otros Gastos (describa):                                                  "]
["TOTAL INGRESOS",null,null,null,null,null,null,null,null,null,null,null,null,null,"TOTAL GASTOS"]
["6.    DETALLE DE CUENTAS E INVERSIONES DEL CLIENTE EN EL SISTEMA FINANCIERO"]
[null,null,"Nombre de la Institución",null,null,null,null,null,null,null,null,"Tipo de Cuenta",null,null,null,null,null,null,null,null,null,null,null,"No. Cuenta"]
["Cliente:"]
["Representante Legal/Apoderado:"]
["7.   DETALLE DE TRANSACCIONES Y/O PRODUCTOS FINANCIEROS QUE POSEE EN DIVISAS INTERNACIONALES\n(Si el cliente es menor de edad entregar datos del Representante Legal y/o Apoderado)"]
["Tipo de producto o servicio","Identificación del producto o servicio",null,null,null,null,null,null,null,"Entidad",null,null,null,null,"Monto",null,null,null,"Ciudad",null,null,null,"País",null,null,null,"Moneda"]
[]
[]
["8.   REFERENCIAS PERSONALES / COMERCIALES\n(Si el cliente es menor de edad entregar datos del Representante Legal y/o Apoderado)"]
["PERSONALES",null,null,null,null,null,null,null,null,null,null,null,null,"COMERCIALES"]
["Nombres Completos",null,null,"Relación",null,null,null,null,null,"Teléfono",null,null,null,"Nombre/Razón Social",null,null,null,null,null,null,null,"Relación",null,null,null,"Teléfono"]
[]
[]
[]
[]
[]
[]
[]
[2]
[]
[]
[]
[]
[]
[]
[]
[]
[]
[]
[]
[null,null,null,null,null,null,null,null,null,null,null,null,null,null,null,null,null,null,null,null,null,null,null,null,null,null,null,"FDV - 001"]
[]
["9.   DECLARACIÓN SOBRE LA CONDICIÓN DE PERSONA EXPUESTA POLÍTICAMENTE\n(Si el cliente es menor de edad entregar datos del Representante Legal y/o Apoderado)"]
["Declaro bajo juramento que:  SI         /NO          soy una Persona Expuesta Políticamente (PEP). Si la respuesta es positiva favor indicar lo siguiente:\nNombre de la Institución:  _____________________________  Cargo o Función ejercido en la Entidad Pública: __________________ Tiempo de trabajo: __________________________         Fecha del nombramiento de designación: __________________________ Fecha de culminación de funciones (cese de actividades en los últimos 2 años):                                                                                         \nActualmente declaro que: SI      /NO      mantengo vinculación comercial (      ), contractual (      ), familiar dentro del segundo grado de consanguinidad (padres, hijos, abuelos, hermanos, nietos) o primero de afinidad (suegros, hijastros), con una Persona Expuesta Políticamente (PEP). Si su respuesta fue positiva favor especificar lo siguiente:\nNombre de la persona: __________________________________________________  Relación de parentesco: _____________________________ Cargo o Función: _____________________________________________    Nombre de la Institución: ______________________________________"]
["Adicionalmente declaro que: SI         /NO          mantengo vinculación laboral, como asesor (      ), asistente (      ) o cualquier otra labor de confianza (      ), con una Persona Expuesta Políticamente (PEP). Si su respuesta fue positiva favor especificar lo siguiente:\nNombre de la persona: _______________________________________ Cargo o Función: ________________________________________                                                                  Nombre de la Institución: _____________________________________________________________________________________________"]
["10.   DECLARACIÓN DE LICITUD DE FONDOS"]
["Los fondos que ingresarán al producto contratado provienen de (por favor adjuntar obligatoriamente documentos físicos, en valores iguales o superiores a USD 30.000): _____________________________________________________________________________________________\nLos fondos existentes en el producto contratado serán utilizados para:                                                                                                                                                                           __________\n"]
["CONOCEDOR (A) DE LAS PENAS DE PERJURIO DECLARO BAJO JURAMENTO QUE LA INFORMACIÓN ARRIBA INDICADA ES CORRECTA Y VERDADERA, ENTIENDO QUE LA MISMA SERÁ LEÍDA/ REVISADA POR LAS AUTORIDADES COMPETENTES, QUIENES LA PODRÁN  CONSIDERAR PARA TODOS LOS EFECTOS LEGALES QUE CONSIDEREN  NECESARIOS. AUTORIZO EXPRESA E INDEFINIDAMENTE A LA COMPAÑÍA ADMINISTRADORA DE FONDOS Y FIDEICOMISOS FIDEVAL S.A., MIENTRAS SEA CLIENTE DE LA MISMA PARA QUE A TRAVÉS DE SU REPRESENTANTE LEGAL O FUNCIONARIOS AUTORIZADOS OBTENGA DE CUALQUIER FUENTE INFORMACIÓN LEGALMENTE AUTORIZADA, REALICEN EL ANÁLISIS Y VERIFICACIONES QUE CONSIDEREN PERTINENTES A TRAVÉS DE LOS MEDIOS NECESARIOS, E INFORMEN DE MANERA INMEDIATA Y DOCUMENTADA A LA AUTORIDAD COMPETENTE EN CASOS DE INVESTIGACIÓN O CUANDO SE DETECTARE INUSUALIDADES O TRANSACCIONES SOSPECHOSAS. GARANTIZO LA VERACIDAD DE LA INFORMACION PROPORCIONADA Y RENUNCIO A EJECUTAR CUALQUIER PRETENSIÓN TANTO EN EL ÁMBITO CIVIL COMO PENAL POR ESTOS HECHOS, ACOGIENDOME A LAS SANCIONES QUE POR INFORMACIÓN FALSA ESTABLEZCAN LAS LEYES ECUATORIANAS. FACULTO EXPRESAMENTE A LA COMPAÑÍA FIDEVAL S.A. ADMINISTRADORA DE FONDOS Y FIDEICOMISOS PARA TRANSFERIR O ENTREGAR DICHA INFORMACIÓN A AUTORIDADES COMPETENTES Y ORGANISMOS DE CONTROL, ASÍ COMO A OTRAS INSTITUCIONES O PERSONAS JURÍDICAS LEGALMENTE FACULTADAS PARA SOLICITAR DICHA INFORMACIÓN. IGUALMENTE CERTIFICO Y DECLARO QUE LOS VALORES ENTREGADOS SON LÍCITOS Y CONSECUENTEMENTE NO PROVIENEN DE NINGUNA ACTIVIDAD ILEGAL O ILÍCITA, NI LOS FONDOS SERÁN DESTINADOS A ACCIONES RELACIONADAS Y TIPIFICADAS EN LAS LEYES DE PREVENCIÓN DE LAVADO DE ACTIVOS VIGENTES. EN CONSTANCIA DE CONOCER Y ACEPTAR LO DECLARADO ANTERIORMENTE, FIRMO EL PRESENTE DOCUMENTO."]
[]
[]
[null,"Firma ",null,null,null,null,null,null,null,null,null,null,null,null,null,"Ciudad y Fecha (aa/mm/dd)"]
[]
[]
[null,"Identificación",null,null,null,null,null,null,null,null,null,null,null,null,null,"Nombre del firmante"]
[]
[]
[null,"Calidad en la que funge el firmante (si el formulario no es firmado por la persona que ejerce el control)"]
[]
["11.  PARA USO EXCLUSIVO FIDEVAL S.A."]
["Nombre y cargo de quien recibe la información:                                                                                                                                       Fecha:                                                                             Firma del Responsable:                                                                                                                                                             \nDeclaro que la información y documentación receptada se encuentra de forma correcta y completa, a la fecha de entrega del presente formulario."]
["12.  VERIFICACIÓN DE DATOS"]
["DETALLE","SI",null,null,null,null,null,null,"NO",null,null,null,null,"DETALLE",null,null,null,null,"SI",null,null,null,null,"NO"]
["Identificación:",null,null,null,null,null,null,null,null,null,null,null,null,"Direcciones:"]
["Teléfonos:",null,null,null,null,null,null,null,null,null,null,null,null,"Actividad Económica:"]
["Referencias:",null,null,null,null,null,null,null,null,null,null,null,null,"Firma:"]
["Fecha de ingreso de datos en el sistema:",null,null,null,null,null,null,null,null,null,null,null,null,"Validación Listas de Observados:"]
["    OBSERVACIONES:"]
["   _____________________________________________________________________________________"]
["   _____________________________________________________________________________________"]
["   _____________________________________________________________________________________"]
[]
[]
[3]

{"sheet":"CONOZCA A SU CLIENTE PJ","index":23,"n_rows":8,"n_cols":1,"rows_kept":8,"cut":false,"hidden":true,"merged":[]}
[]
[]
[]
[]
[]
["Formulario Conozca a Su Cliente - Personas Jurídicas"]
[]
["Hacer click en el siguiente ícono:"]

{"sheet":"CONOZCA A SU CLIENTE PJ(2)","index":24,"n_rows":167,"n_cols":28,"rows_kept":167,"cut":false,"hidden":true,"merged":[[8,0,8,7],[8,8,8,23],[8,24,8,29],[9,0,9,16],[9,17,9,29],[10,0,10,5],[10,6,10,16],[10,17,10,29],[4,0,4,29],[5,0,5,29],[6,0,6,29],[7,0,7,7],[7,8,7,23],[7,24,7,29],[11,0,11,29],[12,0,12,2],[12,3,12,12],[12,13,12,20],[12,21,12,29],[13,0,13,2],[13,3,13,12],[13,13,13,20],[13,21,13,29],[17,0,17,29],[18,0,18,6],[18,7,18,16],[18,17,18,29],[19,0,19,6],[19,7,19,16],[19,17,19,29],[14,0,14,2],[14,3,14,12],[14,13,14,20],[14,21,14,29],[15,0,15,29],[16,0,16,29],[23,0,23,29],[24,0,24,29],[25,0,25,12],[25,13,25,29],[26,0,26,29],[27,0,27,29],[20,0,20,29],[21,0,21,4],[21,5,21,13],[21,14,21,20],[21,21,21,29],[22,0,22,29],[31,0,31,6],[31,7,31,16],[31,17,31,29],[32,0,32,29],[33,0,33,6],[33,7,33,16],[33,17,33,29],[28,0,28,6],[28,7,28,16],[28,17,28,29],[29,0,29,12],[29,14,29,29],[30,0,30,29],[36,0,36,29],[44,0,44,29],[45,0,45,29],[46,0,46,29],[47,0,47,29],[48,0,50,6],[48,7,50,10],[48,11,50,14],[48,15,50,20],[48,21,49,29],[52,0,52,6],[52,7,52,10],[52,11,52,14],[52,15,52,20],[52,21,52,25],[52,26,52,29],[50,21,50,25],[50,26,50,29],[51,0,51,6],[51,7,51,10],[51,11,51,14],[51,15,51,20],[51,21,51,25],[51,26,51,29],[54,0,54,29],[55,0,55,6],[55,7,55,10],[55,11,55,16],[55,17,55,22],[55,23,55,29],[53,0,53,6],[53,7,53,10],[53,11,53,14],[53,15,53,20],[53,21,53,25],[53,26,53,29],[56,0,56,6],[56,7,56,10],[56,11,56,16],[56,17,56,22],[56,23,56,29],[57,0,57,6],[57,7,57,10],[57,11,57,16],[57,17,57,22],[57,23,57,29],[60,0,60,6],[60,7,60,16],[60,17,60,22],[60,23,60,29],[61,0,61,6],[61,7,61,16],[61,17,61,22],[61,23,61,29],[58,0,58,6],[58,7,58,10],[58,11,58,16],[58,17,58,22],[58,23,58,29],[59,0,59,29],[62,0,62,12],[62,13,62,29],[63,0,63,9],[63,10,63,17],[63,18,63,28],[64,0,64,6],[64,7,64,11],[64,12,64,16],[64,17,64,29],[65,0,65,6],[65,7,65,11],[65,12,65,16],[65,17,65,29],[66,0,66,29],[67,0,67,4],[67,5,67,10],[67,11,67,16],[67,17,67,24],[67,25,67,29],[70,0,70,29],[71,0,71,10],[71,11,71,24],[71,25,71,29],[72,0,72,10],[72,11,72,24],[72,25,72,29],[68,0,68,4],[68,5,68,10],[68,11,68,16],[68,17,68,24],[68,25,68,29],[69,0,69,29],[73,0,73,10],[73,11,73,24],[73,25,73,29],[74,0,74,29],[75,0,75,4],[75,5,75,10],[75,11,75,15],[75,16,75,20],[75,21,75,25],[75,26,75,29],[77,0,77,4],[77,5,77,10],[77,11,77,15],[77,16,77,20],[77,21,77,25],[77,26,77,29],[76,0,76,4],[76,5,76,10],[76,11,76,15],[76,16,76,20],[76,21,76,25],[76,26,76,29],[78,0,78,29],[79,0,79,29],[82,0,82,29],[90,0,90,3],[90,4,90,7],[90,8,90,11],[90,12,90,15],[90,16,90,19],[90,20,90,23],[90,24,90,29],[91,24,91,29],[92,0,92,3],[92,4,92,7],[92,8,92,11],[92,12,92,15],[92,16,92,19],[92,20,92,23],[92,24,92,29],[91,0,91,3],[91,4,91,7],[91,8,91,11],[91,12,91,15],[91,16,91,19],[91,20,91,23],[95,0,95,29],[96,0,96,4],[96,5,96,11],[96,12,96,16],[96,17,96,22],[96,23,96,29],[93,24,93,29],[94,0,94,3],[94,4,94,7],[94,8,94,11],[94,12,94,15],[94,16,94,19],[94,20,94,23],[94,24,94,29],[93,0,93,3],[93,4,93,7],[93,8,93,11],[93,12,93,15],[93,16,93,19],[93,20,93,23],[97,0,97,4],[97,5,97,11],[97,12,97,16],[97,17,97,22],[97,23,97,29],[98,0,98,4],[98,5,98,11],[98,12,98,16],[98,17,98,22],[98,23,98,29],[101,0,101,29],[102,0,102,29],[103,0,103,29],[106,3,106,8],[106,16,106,24],[109,3,109,8],[109,16,109,24],[99,0,99,4],[99,5,99,11],[99,12,99,16],[99,17,99,22],[99,23,99,29],[100,0,100,29],[114,0,114,29],[115,0,115,29],[116,0,116,29],[117,0,117,29],[128,0,128,29],[129,0,129,8],[129,9,129,11],[129,12,129,13],[129,14,129,23],[129,24,129,26],[131,0,131,8],[131,9,131,11],[131,12,131,13],[131,14,131,23],[131,24,131,26],[131,27,131,29],[129,27,129,29],[130,0,130,8],[130,9,130,11],[130,12,130,13],[130,14,130,23],[130,24,130,26],[130,27,130,29],[133,0,133,8],[133,9,133,11],[133,12,133,13],[133,14,133,23],[133,24,133,26],[133,27,133,29],[132,0,132,8],[132,9,132,11],[132,12,132,13],[132,14,132,23],[132,24,132,26],[132,27,132,29],[147,0,147,29],[148,0,148,29],[149,0,149,29],[166,0,166,29],[134,0,134,29],[135,0,135,28],[143,0,143,29],[144,0,144,29],[145,0,145,29],[146,0,146,29]]}
[]
[]
[]
[null,null,null,null,null,null,null,null,null,null,null,null,null,null,null,null,null,null,null,null,null,null,null,null,null,null,null,"FDV - 002"]
["FORMULARIO CONOZCA SU CLIENTE – PERSONAS JURÍDICAS"]
["En cumplimiento a lo establecido en la Ley Orgánica de Prevención, Detección y Erradicación del Delito de Lavado de Activos y del Financiamiento de Delitos, su Reglamento General, Codificación de Resoluciones Monetarias Financieras, de Valores y Seguros, Resolución NAC-DGERCGC19-00000045 del Servicio de Rentas Internas, Políticas Internas de Prevención de Lavado de Activos y la Ley Foreign Account Tax Compliance Act (FATCA) se requiere a la persona jurídica la entrega de la siguiente información (favor completar todos los campos obligatoriamente)."]
["1.    INFORMACIÓN GENERAL DE LA COMPAÑÍA"]
["Razón Social",null,null,null,null,null,null,null,"Objeto Social",null,null,null,null,null,null,null,null,null,null,null,null,null,null,null,"País de Constitución"]
[]
["Actividad Económica:",null,null,null,null,null,null,null,null,null,null,null,null,null,null,null,null,"RUC:"]
["Teléfonos:",null,null,null,null,null,"Correo electrónico:",null,null,null,null,null,null,null,null,null,null,"Página web:"]
["Sucursales y Agencias (favor adjuntar una hoja adicional en caso de ser necesario):"]
["Nombre",null,null,"Cuidad y Dirección",null,null,null,null,null,null,null,null,null,"Teléfonos",null,null,null,null,null,null,null,"Gerente de la Sucursal/Agencia"]
[]
[]
["2.    AUTO – CERTIFICACIÓN DE RESIDENCIA FISCAL DEL CLIENTE"]
["Conforme a las regulaciones del Estándar Común de Reporte (CRS por sus siglas en ingles) en el marco de la OCDE (Organización para la Cooperación y Desarrollo Económico). Lo establecido en la Disposición General Primera de la Ley Orgánica para la Reactivación de la Economía, Fortalecimiento de la Dolarización y Modernización de la Gestión, publicada en el Suplemento del Registro Oficial No. 150 de 29 de diciembre de 2017 y según lo señalado en la Resolución NAC-DGERCGC19-000000045 del Servicio de Rentas Internas, publicada en el Suplemento del Registro Oficial Nro. 51 de 01 de octubre de 2019, se ha dispuesto la obligación de reportar información específica sobre la residencia fiscal de una cuenta. Con el objeto de dar cumplimiento con la normativa expuesta, se incluye en este documento la auto- certificación de su residencia fiscal a fin de que los datos registrados, sean transmitidos al Servicio de Rentas Internas que a su vez podrá enviar esta información a las autoridades fiscales de otras jurisdicciones, en virtud de acuerdos intergubernamentales para intercambiar información de cuentas financieras.\n¿Quién debe llenar esta Auto - certificación?: El representante que posea una o más cuentas a nombre de una sociedad. En caso de poseer cuentas conjuntas o a nombre de varias sociedades debe firmar la presente Auto – certificación por cada sociedad. Tener en cuenta que esta Auto – certificación es solo a efectos del CRS. El hecho de completarlo no sustituye realizar cualquier Formulario W-9, W-8 o de Auto – certificación del IRS que pueda requerirse de otra manera para la Ley FATCA u otros propósitos fiscales estadounidenses."]
["Domicilio Legal: (calle transversal, numero edificio, piso):"]
["Ciudad:",null,null,null,null,null,null,"Provincia:",null,null,null,null,null,null,null,null,null,"Cantón:"]
["Parroquia:",null,null,null,null,null,null,"País:",null,null,null,null,null,null,null,null,null,"Código postal:"]
["Dirección Postal: (calle, transversal, numero edificio, piso):"]
["Ciudad:",null,null,null,null,"Provincia:",null,null,null,null,null,null,null,null,"País:",null,null,null,null,null,null,"Código postal:"]
["1. Institución Financiera: Sociedad de Inversión\n1.1 ¿Es una sociedad de inversión localizada en una jurisdicción no participante y manejada por otra institución financiera? SI(   )  NO(   )\nSi marca la opción SI, debe completar el formulario de “Auto – Certificación de Persona que Ejerce el Control FDV - 010”.\n1.2 ¿Otro tipo de sociedad de inversión?   SI (      ) NO (      )"]
["2. Es una Institución financiera: ¿Institución de depósito, custodia, o Compañía de Seguros específica? SI (      )   NO (      )"]
["3. ¿Es una entidad cuyas acciones se cotizan en bolsa?: SI (    ) NO (    ). Si marca la opción SÍ, indique cuál es el nombre del mercado en donde se cotiza:"]
["4. ¿Es una entidad gubernamental u organismo internacional u organización sin fines de lucro?: SI (      ) NO (      )",null,null,null,null,null,null,null,null,null,null,null,null,"¿Es una entidad obligada a pagar Impuesto a la Renta?:\nSI (      )    NO (      )"]
["5. ¿Es una Entidad NO Financiera Pasiva? SI (    ) NO (      )\nSi marca la opción SI, debe completar el formulario de “Auto – Certificación de Persona que Ejerce el Control FDV - 010”."]
["6. A continuación indique el nombre(s) de la(s) persona(s) que ejerce(n) el control sobre la sociedad titular de la cuenta: por cada una de estas personas, adicionalmente llene una Auto – certificación de persona que ejerce el control (si es que marcó SI en la opción 1.1 y 5):"]
["1)",null,null,null,null,null,null,"2)",null,null,null,null,null,null,null,null,null,"3)"]
["7. ¿Es una sociedad estadounidense para fines fiscales (la empresa paga impuestos en EEUU)? SI (      ) NO (      )",null,null,null,null,null,null,null,null,null,null,null,null,null,"Si marcó SI, indique el número de identificación como contribuyente en Estados Unidos:"]
["8. ¿La Sociedad es residente de cualquier otro país distinto de Estados Unidos y Ecuador para fines fiscales (país donde paga impuestos) ?:  SI (        ) NO (        ). Si la respuesta es positiva por favor enumere a continuación el/los países en donde es residente (donde paga impuestos):"]
["1)",null,null,null,null,null,null,"2)",null,null,null,null,null,null,null,null,null,"3)"]
["Proporcione a continuación el número de identificación como contribuyente para cada país que indicó anteriormente:"]
["1)",null,null,null,null,null,null,"2)",null,null,null,null,null,null,null,null,null,"3)"]
[]
[]
[1]
[]
[]
[]
[]
[null,null,null,null,null,null,null,null,null,null,null,null,null,null,null,null,null,null,null,null,null,null,null,null,null,null,null,"FDV - 002"]
[]
["Certifico que la información proporcionada en este formulario es correcta y completa."]
[" Autorizo a FIDEVAL S.A. a proporcionar, directa o indirectamente, la Información contenida en este formulario y/o una copia de este formulario a cualquier autoridad fiscal pertinente o cualquier parte autorizada para auditar o realizar un control similar de FIDEVAL S.A. para fines fiscales, así como a divulgar a tales autoridades fiscales o tal parte cualquier información adicional que pudiese poseer FIDEVAL S.A. y que es pertinente para mi calificación para cualquier beneficio reclamado con base en esta certificación."]
[" Acepto que la información contenida en este formulario y la información relacionada con mis cuentas en FIDEVAL S.A. (incluso la información sobre los saldos de cuentas y pagos recibidos) se notifique a las autoridades fiscales pertinentes, y que estas autoridades proporcionen esta información a cualquier otro país enumerado en la lista anterior como a un país en el cual soy residente para fines fiscales."]
[" Me comprometo a avisar inmediatamente a FIDEVAL S.A. sobre cualquier cambio en las circunstancias que motive que la información contenida en este documento sea incorrecta y a proporcionar a FIDEVAL S.A. un formulario actualizado y apropiado de Auto-certificación de Residencia Fiscal en un plazo de 30 días a partir de la fecha del cambio en las circunstancias."]
["3. ACCIONISTAS DESDE EL 10% DE PARTICIPACIÓN (de ser necesario adjuntar lista de los mismos por separado)"]
["Nombres Completos/Razón Social",null,null,null,null,null,null,"ID/Pasaporte/RUC",null,null,null,"Nacionalidad",null,null,null,"% Participación",null,null,null,null,null,"Es residente de cualquier otro país distinto de Ecuador para fines fiscales (país donde paga impuestos)."]
[]
[null,null,null,null,null,null,null,null,null,null,null,null,null,null,null,null,null,null,null,null,null,"Si",null,null,null,null,"No"]
[]
[]
[]
["Si su respuesta es positiva por favor enumere a continuación el/los países y el número de identificación tributaria en dichos países:"]
["Nombres Completos/Razón Social",null,null,null,null,null,null,"País",null,null,null,"# Identificación Tributaria",null,null,null,null,null,"País",null,null,null,null,null,"# Identificación Tributaria"]
[]
[]
[]
["4. INFORMACIÓN DEL REPRESENTANTE LEGAL Y/O APODERADO"]
["REPRESENTANTE LEGAL/APODERADO:  Nombres Completos",null,null,null,null,null,null,"Número de identificación/Pasaporte",null,null,null,null,null,null,null,null,null,"Nacionalidad",null,null,null,null,null,"Teléfono domicilio"]
[null,null,null,null,null,null,null,null,null,null,null,null,null,null,null,null,null,null,null,null,null,null,null," "]
["Dirección domicilio/residencia:",null,null,null,null,null,null,null,null,null,null,null,null,"Lugar y fecha de nacimiento (aa/mm/dd):"]
["Número y fecha de la escritura pública del poder respectivo (en caso de Apoderado):"]
["CÓNYUGE: Nombres Completos",null,null,null,null,null,null,"ID/Pasaporte",null,null,null,null,"Nacionalidad",null,null,null,null,"Actividad Económica"]
["5.    ESTADO DE SITUACIÓN FINANCIERA DE LA COMPAÑÍA"]
["5. ESTADO DE SITUACIÓN FINANCIERA DE LA COMPAÑÍA"]
["Total Activos",null,null,null,null,"Total Pasivos",null,null,null,null,null,"Patrimonio Neto ",null,null,null,null,null,"Total Ingresos",null,null,null,null,null,null,null,"Total Gastos"]
[]
["Fecha de corte a la que pertenece la información financiera:"]
["6. DETALLE DE CUENTAS E INVERSIONES QUE POSEE LA EMPRESA EN EL SISTEMA FINANCIERO"]
["Nombre de la Institución",null,null,null,null,null,null,null,null,null,null,"Tipo de Cuenta",null,null,null,null,null,null,null,null,null,null,null,null,null,"No. Cuenta"]
[]
[]
["7. DETALLE DE TRANSACCIONES Y/O PRODUCTOS FINANCIEROS QUE POSEE EN DIVISAS INTERNACIONALES (en caso de aplicar)"]
["Tipo del producto o servicio",null,null,null,null,"Identificación del producto o servicio",null,null,null,null,null,"Entidad",null,null,null,null,"Monto ",null,null,null,null,"País",null,null,null,null,"Moneda"]
[]
[]
["9. DECLARACIÓN SOBRE LA CONDICIÓN DE PERSONA EXPUESTA POLÍTICAMENTE "]
["Declaro bajo juramento que el/los Socio(s), Accionista(s) que usted Representa SI____ /NO _____ y/o el Representante Legal SI ___ /NO ___, son Personas Expuestas Políticamente. Si su respuesta es positiva en cualquier campo favor llenar la siguiente información:"]
[]
[]
[2]
[]
[]
[]
[]
[]
[null,null,null,null,null,null,null,null,null,null,null,null,null,null,null,null,null,null,null,null,null,null,null,null,null,null,null,"FDV - 002"]
[]
["Representante Legal/Socio/   Accionista",null,null,null,"Nombres Completos y Cédula de Identidad / RUC",null,null,null,"Cargo o Función ejercido en la Entidad Pública",null,null,null,"Nombre de la Institución Pública",null,null,null,"Tiempo de trabajo",null,null,null,"Fecha del nombramiento de designación",null,null,null,"Fecha de culminación en el cargo público (cese de actividades en los últimos 2 años)"]
[]
[]
[]
[]
["Adicionalmente declaro que el/los Socio(s), Accionista(s) y/o Representante Legal, SI       / NO       mantienen vinculación: comercial                  (      ), contractual (      ), laboral (      ), familiar dentro del segundo grado de consanguinidad (padres, hijos, abuelos, hermanos, nietos) o primero de afinidad (suegros, hijastros) ( ), con una Persona Expuesta Políticamente. Si la respuesta es positiva favor llenar la siguiente información:"]
["Representante Legal/Socio/Accionista",null,null,null,null,"Nombres Completos y Cédula de Identidad / RUC del PEP",null,null,null,null,null,null,"Relación de Parentesco",null,null,null,null,"Cargo o Función",null,null,null,null,null,"Nombre de la Institución Pública"]
[]
[]
[]
["10.           DECLARACIÓN DE LICITUD DE FONDOS"]
["Los fondos que ingresarán al producto contratado provienen de: _____________________________________________________________________ __________________________________________________________________________________________________________________________________"]
["Los fondos existentes en el producto contratado serán utilizados para: _______________________________________________________________ __________________________________________________________________________________________________________________________________"]
["CONOCEDOR (A) DE LAS PENAS DE PERJURIO DECLARO BAJO JURAMENTO QUE LA INFORMACIÓN ARRIBA INDICADA ES CORRECTA Y VERDADERA, ENTIENDO QUE LA MISMA SERÁ LEÍDA/ REVISADA POR LAS AUTORIDADES COMPETENTES, QUIENES LA PODRÁN CONSIDERAR PARA TODOS LOS EFECTOS LEGALES QUE CONSIDEREN NECESARIOS. AUTORIZO EXPRESA E INDEFINIDAMENTE A LA COMPAÑÍA ADMINISTRADORA DE FONDOS Y FIDEICOMISOS FIDEVAL S.A., MIENTRAS SEA CLIENTE DE LA MISMA PARA QUE A TRAVÉS DE SU REPRESENTANTE LEGAL O FUNCIONARIOS AUTORIZADOS OBTENGA DE CUALQUIER FUENTE INFORMACIÓN LEGALMENTE AUTORIZADA, REALICEN EL ANÁLISIS Y VERIFICACIONES QUE CONSIDEREN PERTINENTES A TRAVÉS DE LOS MEDIOS NECESARIOS, E INFORMEN DE MANERA INMEDIATA Y DOCUMENTADA A LA AUTORIDAD COMPETENTE EN CASOS DE INVESTIGACIÓN O CUANDO SE DETECTARE INUSUALIDADES O TRANSACCIONES SOSPECHOSAS. GARANTIZO LA VERACIDAD DE LA INFORMACION PROPORCIONADA Y RENUNCIO A EJECUTAR CUALQUIER PRETENSIÓN TANTO EN EL ÁMBITO CIVIL COMO PENAL POR ESTOS HECHOS, ACOGIENDOME A LAS SANCIONES QUE POR INFORMACIÓN FALSA ESTABLEZCAN LAS LEYES ECUATORIANAS. FACULTO EXPRESAMENTE A LA COMPAÑÍA FIDEVAL S.A. ADMINISTRADORA DE FONDOS Y FIDEICOMISOS PARA TRANSFERIR O ENTREGAR DICHA INFORMACIÓN A AUTORIDADES COMPETENTES Y ORGANISMOS DE CONTROL, ASÍ COMO A OTRAS INSTITUCIONES O PERSONAS JURÍDICAS LEGALMENTE FACULTADAS PARA SOLICITAR DICHA INFORMACIÓN. IGUALMENTE CERTIFICO Y DECLARO QUE LOS VALORES ENTREGADOS SON LÍCITOS Y CONSECUENTEMENTE NO PROVIENEN DE  NINGUNA ACTIVIDAD ILEGAL O ILÍCITA, NI LOS FONDOS SERÁN DESTINADOS A ACCIONES RELACIONADAS Y TIPIFICADAS EN LAS LEYES DE PREVENCIÓN DE LAVADO DE ACTIVOS VIGENTES. EN CONSTANCIA DE CONOCER Y ACEPTAR LO DECLARADO ANTERIORMENTE, FIRMO EL PRESENTE DOCUMENTO."]
[]
[]
[null,null,null,"Firma ",null,null,null,null,null,null,null,null,null,null,null,null,"Ciudad y Fecha (aa/mm/dd)"]
[]
[]
[null,null,null,"Identificación",null,null,null,null,null,null,null,null,null,null,null,null,"Nombre del firmante"]
[]
[]
[null,null,"Calidad en la que funge el firmante (si el formulario no es firmado por la persona que ejerce el control)"]
[]
["11.  PARA USO EXCLUSIVO FIDEVAL S.A."]
["Nombre y cargo de quien recibe la información: _____________________________________________         Fecha: ______________________________ Firma del Responsable: ___________________________________________________________________"]
["Declaro que la información y documentación receptada se encuentra de forma correcta y completa, a la fecha de entrega del presente formulario. "]
[2]
[]
[]
[]
[]
[]
[]
[]
[]
[null,null,null,null,null,null,null,null,null,null,null,null,null,null,null,null,null,null,null,null,null,null,null,null,null,null,null,"FDV - 002"]
[]
["12. VERIFICACIÓN DE DATOS"]
["DETALLE ",null,null,null,null,null,null,null,null,"SI",null,null,"NO ",null,"DETALLE",null,null,null,null,null,null,null,null,null,"SI",null,null,"NO "]
["Identificación:",null,null,null,null,null,null,null,null,null,null,null,null,null,"Direcciones:"]
["Teléfonos:",null,null,null,null,null,null,null,null,null,null,null,null,null,"Actividad Económica:"]
["Referencias:",null,null,null,null,null,null,null,null,null,null,null,null,null,"Firma:"]
["Certificado de Residencia Fiscal emitido por el SRI:",null,null,null,null,null,null,null,null,null,null,null,null,null,"Validación Listas de Observados:"]
["Fecha de ingreso de datos en el sistema:"]
["   OBSERVACIONES:"]
[]
[]
[]
[]
[]
["Glosario:"]
[]
["a)    Compañía de Seguros Específica: Significa toda entidad que sea una compañía aseguradora (o la sociedad holding de una compañía aseguradora) que ofrece un Contrato de Seguro con valor en efectivo o un contrato de anualidades o está obligada a efectuar pagos en relación con los mismos. (es decir un contrato de seguro con un componente de inversión). No incluye compañías de seguro que solo brindan seguros generales o de vida, o compañías de reaseguros que solo ofrecen contratos de indemnización."]
["b) Entidad de Inversión: significa toda Entidad cuya actividad económica principal consiste en una o varias de las siguientes actividades u operaciones por cuenta o en nombre de un cliente. a) transacciones con instrumentos del mercado monetario (cheques, letras, certificados de depósito o instrumentos derivaos, entre otros); cambio de divisas; instrumentos de los mercados cambiario y monetario, tipos de interés e índices; valores negociables, o negociación de futuros de productos básicos. b) gestión individual o colectiva de cartera, c) otras operaciones de inversión, administración o gestión de Activos Financieros o dinero en nombre de terceros o cuya renta bruta procede principalmente de una actividad de inversión, reinversión o de negociación de Activos Financieros, si la Entidad está gestionada por otra Entidad que es una Institución de Depósito, una Institución de Custodia, una Compañía de Seguros Especifica o una Entidad de Inversión."]
["c)    Entidad que cotiza en Bolsa y/o Afiliada: Las acciones públicamente transadas deben representar más del 50% del poder de voto de la Entidad."]
["d)    Entidad NO Financiera Activa:  Entidad cuya actividad principal e  ingresos provienen de la actividad  productiva y  no de  la financiera. Sus  activos financieros/total de activos e ingresos financieros/total de ingresos deben ser inferior a 50%."]
["e)    Entidad NO Financiera Pasiva: Sus ingresos financieros o activos financieros son superiores al 50% respectivamente de sus ingresos y activos totales."]
["f)     Entidad sin fines de lucro: Entidad con fines exclusivos religiosos, caritativos, científicos, artísticos, culturales o educativos que: a) no está sujeta al impuesto a la renta. b)  no tiene accionistas o miembros con derechos propietarios sobre sus activos o ingresos."]
["g)    Institución de depósito: significa toda Entidad que acepta depósitos en el marco habitual de su actividad bancaria o similar."]
[]
[]
[]
[]
[]
[]
[]
[]
[]
[]
[]
[]
[]
[]
[]
[]
[4]

{"sheet":"CálculosSeguro","index":25,"n_rows":53,"n_cols":9,"rows_kept":53,"cut":false,"hidden":true,"merged":[[7,5,7,6],[2,5,2,6],[3,5,3,6],[4,5,4,6],[5,5,5,6],[6,5,6,6],[27,5,27,6],[8,5,8,6],[13,5,13,6],[14,5,14,6],[15,5,15,6],[16,5,16,6],[17,5,17,6],[18,5,18,6],[19,5,19,6],[24,5,24,6],[25,5,25,6],[26,5,26,6],[47,5,47,6],[28,5,28,6],[29,5,29,6],[30,5,30,6],[35,5,35,6],[36,5,36,6],[37,5,37,6],[38,5,38,6],[39,5,39,6],[40,5,40,6],[41,5,41,6],[46,5,46,6],[48,5,48,6],[49,5,49,6],[50,5,50,6],[51,5,51,6],[52,5,52,6]]}
[null,"Meses",null,"MARCA","MODELO","AÑO","VALOR ASEGURADO","TASA","PRIMA NETA"]
[null,{"$f":"+IF('AIG- Cotizador Seguro'!B8>=12,12,'AIG- Cotizador Seguro'!B8)","v":12},null,{"$f":"+'AIG- Cotizador Seguro'!B5","v":"HYUNDAI"},{"$f":"+'AIG- Cotizador Seguro'!B6","v":"ACCENT"},1,{"$f":"+'AIG- Cotizador Seguro'!B7","v":35000},{"$f":"+_xlfn.IFS(G2<=20000,4.5%,G2<=25000,4.3%,G2<=30000,3.9%,G2<=35000,3.6%,G2<=40000,3.4%,G2<=45000,3.2%,G2<=50000,2.8%,G2>50000,2.6%)","v":3.6000000000000004E-2},{"$f":"+(H2*G2)*(B2/12)","v":1260.0000000000002}]
[null,null,null,null,null,"SUBTOTAL PRIMA",null,null,{"$f":"+SUM(I2:I2)","v":1260.0000000000002}]
[null,null,null,null,null,"SUPER DE BANCOS",null,3.5000000000000003E-2,{"$f":"+I3*H4","v":44.100000000000016}]
[null,null,null,null,null,"SEGURO CAMPESINO",null,5.0000000000000001E-3,{"$f":"+I3*H5","v":6.3000000000000016}]
[null,null,null,null,null,"DERECHOS DE EMISION",null,null,{"$f":"+IF(I2>0,0.04,0)","v":0.04}]
[null,null,null,null,null,"BASE IMPONIBLE IVA",null,null,{"$f":"SUM(I3:I6)","v":1310.44}]
[null,null,null,null,null,"IVA",null,0.15,{"$f":"I7*H8","v":196.566}]
[null,null,null,null,null,"TOTAL",null,null,{"$f":"+I7+I8","v":1507.0060000000001}]
[]
[]
[null,"Meses",null,"MARCA","MODELO","AÑO","VALOR ASEGURADO","TASA","PRIMA NETA"]
[null,{"$f":"+IF(B2<12,0,IF(AND('AIG- Cotizador Seguro'!B8>12,'AIG- Cotizador Seguro'!B8>=24),12,'AIG- Cotizador Seguro'!B8-12))","v":12},null,{"$f":"+D2","v":"HYUNDAI"},{"$f":"+E2","v":"ACCENT"},{"$f":"+F2+1","v":2},{"$f":"+G2*0.88","v":30800},{"$f":"+H2","v":3.6000000000000004E-2},{"$f":"+(H13*G13)*(B13/12)","v":1108.8000000000002}]
[null,null,null,null,null,"SUBTOTAL PRIMA",null,null,{"$f":"+SUM(I13:I13)","v":1108.8000000000002}]
[null,null,null,null,null,"SUPER DE BANCOS",null,3.5000000000000003E-2,{"$f":"+I14*H15","v":38.808000000000007}]
[null,null,null,null,null,"SEGURO CAMPESINO",null,5.0000000000000001E-3,{"$f":"+I14*H16","v":5.5440000000000014}]
[null,null,null,null,null,"DERECHOS DE EMISION",null,null,{"$f":"+IF(I13>0,0.04,0)","v":0.04}]
[null,null,null,null,null,"BASE IMPONIBLE IVA",null,null,{"$f":"SUM(I14:I17)","v":1153.1920000000002}]
[null,null,null,null,null,"IVA",null,0.15,{"$f":"I18*H19","v":172.97880000000004}]
[null,null,null,null,null,"TOTAL",null,null,{"$f":"+I18+I19","v":1326.1708000000003}]
[]
[]
[null,"Meses",null,"MARCA","MODELO","AÑO","VALOR ASEGURADO","TASA","PRIMA NETA"]
[null,{"$f":"+IF(B13<12,0,IF(AND('AIG- Cotizador Seguro'!B8>24,'AIG- Cotizador Seguro'!B8>=36),12,'AIG- Cotizador Seguro'!B8-24))","v":0},null,{"$f":"+D13","v":"HYUNDAI"},{"$f":"+E13","v":"ACCENT"},{"$f":"+F13+1","v":3},{"$f":"+G13*0.92","v":28336},{"$f":"+H13","v":3.6000000000000004E-2},{"$f":"+(H24*G24)*(B24/12)","v":0}]
[null,null,null,null,null,"SUBTOTAL PRIMA",null,null,{"$f":"+SUM(I24:I24)","v":0}]
[null,null,null,null,null,"SUPER DE BANCOS",null,3.5000000000000003E-2,{"$f":"+I25*H26","v":0}]
[null,null,null,null,null,"SEGURO CAMPESINO",null,5.0000000000000001E-3,{"$f":"+I25*H27","v":0}]
[null,null,null,null,null,"DERECHOS DE EMISION",null,null,{"$f":"+IF(I24>0,0.04,0)","v":0}]
[null,null,null,null,null,"BASE IMPONIBLE IVA",null,null,{"$f":"SUM(I25:I28)","v":0}]
[null,null,null,null,null,"IVA",null,0.15,{"$f":"I29*H30","v":0}]
[null,null,null,null,null,"TOTAL",null,null,{"$f":"+I29+I30","v":0}]
[]
[]
[null,"Meses",null,"MARCA","MODELO","AÑO","VALOR ASEGURADO","TASA","PRIMA NETA"]
[null,{"$f":"+IF(B24<12,0,IF(AND('AIG- Cotizador Seguro'!B8>36,'AIG- Cotizador Seguro'!B8>=48),12,'AIG- Cotizador Seguro'!B8-36))","v":0},null,{"$f":"+D24","v":"HYUNDAI"},{"$f":"+E24","v":"ACCENT"},{"$f":"+F24+1","v":4},{"$f":"+G24*0.95","v":26919.199999999997},{"$f":"+H24","v":3.6000000000000004E-2},{"$f":"+(H35*G35)*(B35/12)","v":0}]
[null,null,null,null,null,"SUBTOTAL PRIMA",null,null,{"$f":"+SUM(I35:I35)","v":0}]
[null,null,null,null,null,"SUPER DE BANCOS",null,3.5000000000000003E-2,{"$f":"+I36*H37","v":0}]
[null,null,null,null,null,"SEGURO CAMPESINO",null,5.0000000000000001E-3,{"$f":"+I36*H38","v":0}]
[null,null,null,null,null,"DERECHOS DE EMISION",null,null,{"$f":"+IF(I35>0,0.04,0)","v":0}]
[null,null,null,null,null,"BASE IMPONIBLE IVA",null,null,{"$f":"SUM(I36:I39)","v":0}]
[null,null,null,null,null,"IVA",null,0.15,{"$f":"I40*H41","v":0}]
[null,null,null,null,null,"TOTAL",null,null,{"$f":"+I40+I41","v":0}]
[]
[]
[null,"Meses",null,"MARCA","MODELO","AÑO","VALOR ASEGURADO","TASA","PRIMA NETA"]
[null,{"$f":"+IF(B35<12,0,IF(AND('AIG- Cotizador Seguro'!B8>48,'AIG- Cotizador Seguro'!B8>=60),12,'AIG- Cotizador Seguro'!B8-48))","v":0},null,{"$f":"+D35","v":"HYUNDAI"},{"$f":"+E35","v":"ACCENT"},{"$f":"+F35+1","v":5},{"$f":"+G35*0.95","v":25573.239999999994},{"$f":"+H35","v":3.6000000000000004E-2},{"$f":"+(H46*G46)*(B46/12)","v":0}]
[null,null,null,null,null,"SUBTOTAL PRIMA",null,null,{"$f":"+SUM(I46:I46)","v":0}]
[null,null,null,null,null,"SUPER DE BANCOS",null,3.5000000000000003E-2,{"$f":"+I47*H48","v":0}]
[null,null,null,null,null,"SEGURO CAMPESINO",null,5.0000000000000001E-3,{"$f":"+I47*H49","v":0}]
[null,null,null,null,null,"DERECHOS DE EMISION",null,null,{"$f":"+IF(I46>0,0.04,0)","v":0}]
[null,null,null,null,null,"BASE IMPONIBLE IVA",null,null,{"$f":"SUM(I47:I50)","v":0}]
[null,null,null,null,null,"IVA",null,0.15,{"$f":"I51*H52","v":0}]
[null,null,null,null,null,"TOTAL",null,null,{"$f":"+I51+I52","v":0}]

{"sheet":"TarifasSeguro","index":26,"n_rows":10,"n_cols":4,"rows_kept":10,"cut":false,"hidden":true,"merged":[]}
[]
["Suma Asegurada","Tasa",null,{"$f":"+'AIG- Cotizador Seguro'!B7","v":35000}]
["0-20.000",4.4999999999999998E-2,20000]
["20.001-25.000",4.2999999999999997E-2,25000]
["25.001-30.000",3.9E-2,30000]
["30.001-35.000",3.5999999999999997E-2,35000]
["35.001-40.000",3.4000000000000002E-2,40000]
["40.001-45.000",3.2000000000000001E-2,45000]
["45.001-50.000",2.8000000000000001E-2,50000,{"$f":"+IF(D2<=C3,B3,IF(D2<=C4,B4,IF(D2<=C5,B5,IF(D2<=C6,B6,IF(D2<=C7,B7,IF(D2<=C8,B8,IF(D2<=C9,B9,B10)))))))","v":3.5999999999999997E-2}]
["50.000 en adelante",2.5999999999999999E-2]

{"sheet":"DAT","index":27,"n_rows":2,"n_cols":69,"rows_kept":2,"cut":false,"hidden":true,"merged":[]}
["PÓLIZA","CERTIFICADO","CONTRATANTE","FECHA INGRESO","APELLIDO 1","APELLIDO 2","NOMBRES","CEDULA/RUC","DIRECCIÓN DOMICILIO","TELÉFONO 1","CODIGO TELEF","TELÉFONO 2","CODIGO TELEF","PAIS","CODIGO PAIS","PROVINCIA","CODIGO PROVINCIA","CIUDAD ","CODIGO CIUDAD","LUGAR DE TRABAJO","CARGO","MARCA","marca sise","MODELO ","modelo sise","TIPO","AÑO","COLOR","color sise","MOTOR ","CHASIS","PLACA","CONDUCTOR","VIGENCIA INICIAL","ANIVERSARIO","VALOR AUTO","TASA","PRIMA NETA","SÚPER BANCOS","DERECHOS EMISIÓN","IVA","PRIMA TOTAL","FECHA DE EMISIÓN","NUMERO DE TARJETA","CONCESIONARIO","STATUS","FECHA DE CANCELACIÓN","MOTIVOS","MARCA EXTRAS 1","MODELO EXTRAS 1","VALOR EXTRAS 1","MARCA EXTRAS 2","MODELO EXTRAS 2","VALOR EXTRAS 2","MARCA EXTRAS 3","MODELO EXTRAS 3","VALOR EXTRAS 3","MARCA EXTRAS 4","MODELO EXTRAS 4","VALOR EXTRAS 4","MARCA EXTRAS 5","MODELO EXTRAS 5","VALOR EXTRAS 5","MARCA EXTRAS 6","MODELO EXTRAS 6","VALOR EXTRAS 6","TOTAL EXTRAS","PRIMA EXTRAS","FECHA FIN FINANCTO"]
[51237,1,"DINERS CLUB DEL ECUADOR",{"$f":"CONCATENATE(FORM!F10,\" \",FORM!J10,\" \",FORM!M10)","v":"  "},{"$f":"+FORM!$F$34","v":"PRIMER APELLIDO"},{"$f":"+FORM!L34","v":"SEGUNDO APELLIDO"},{"$f":"+FORM!Q36","v":"PRIMER NOMBRE SEGUNDO NOMBRE"},{"$f":"+FORM!F40","v":"XXXXXXXXXX"},{"$f":"+FORM!F46","v":"CARCELEN"},{"$f":"+FORM!F38","v":"CELULAR"},2,{"$f":"+FORM!L38","v":"CONVENCIONAL"},1,"ECUADOR",1,null,null,{"$f":"+FORM!F48","v":"GUAYAQUIL"},null,{"$f":"+FORM!#REF!","v":{"$error":"#REF!"}},{"$f":"+FORM!#REF!","v":{"$error":"#REF!"}},{"$f":"+FORM!F78","v":"HYUNDAI"},{"$f":"VLOOKUP(V2,FORM!#REF!,2)","v":{"$error":"#REF!"}},{"$f":"+FORM!F80","v":"ACCENT"},null,{"$f":"+FORM!F85","v":"SEDAN"},{"$f":"+FORM!F87","v":"2022"},{"$f":"+FORM!F89","v":"ROJO"},null,{"$f":"+FORM!F91","v":"BU456792826RE7"},{"$f":"+FORM!F93","v":"CG5342892U"},"S / N",{"$f":"CONCATENATE(FORM!Q34,\" \",FORM!F36,\" \",FORM!L36)","v":"PRIMER APELLIDO SEGUNDO APELLIDO PRIMER NOMBRE SEGUNDO NOMBRE"},{"$f":"CONCATENATE(FORM!J10,\" \",FORM!F10,\" \",FORM!M10)","v":"  "},{"$f":"+AH2+365","v":{"$error":"#VALUE!"}},{"$f":"+ROUND(FORM!F101,0)","v":10000},{"$f":"+FORM!#REF!","v":{"$error":"#REF!"}},{"$f":"+FORM!#REF!","v":{"$error":"#REF!"}},{"$f":"+FORM!#REF!","v":{"$error":"#REF!"}},{"$f":"+FORM!#REF!","v":{"$error":"#REF!"}},{"$f":"+FORM!#REF!","v":{"$error":"#REF!"}},{"$f":"+FORM!#REF!","v":{"$error":"#REF!"}},{"$f":"+D2","v":"  "},{"$f":"CONCATENATE(FORM!F151,,FORM!L151)","v":"3608601234567890"},{"$f":"+FORM!F14","v":"CONCESIONARIO"},null,null,null,null,null,null,null,null,null,null,null,null,null,null,null,null,null,null,null,null,null,null,null,{"$f":"IF(FORM!F105=1,'TABLA AMORT.'!B32,IF(FORM!F105=1.5,'TABLA AMORT.'!B38,IF(FORM!F105=2,'TABLA AMORT.'!B44,IF(FORM!F105=3,'TABLA AMORT.'!B56))))","v":false}]

{"sheet":"DESGRAV","index":28,"n_rows":50,"n_cols":26,"rows_kept":50,"cut":false,"hidden":true,"merged":[[14,4,14,5],[14,14,14,17],[49,0,49,25],[37,0,37,25],[38,0,38,25],[39,0,39,25],[40,0,40,25],[41,0,41,25],[42,0,42,25],[43,0,43,25],[44,0,44,25],[45,0,45,25],[47,0,47,15],[47,16,47,25],[36,0,36,25],[24,0,24,25],[25,0,25,25],[26,0,26,25],[27,0,27,25],[28,0,28,25],[29,0,29,25],[31,0,31,25],[32,0,32,25],[33,0,33,25],[34,0,34,25],[35,0,35,25],[22,1,22,11],[22,12,22,16],[22,17,22,24],[23,1,23,11],[23,12,23,16],[23,17,23,24],[21,1,21,11],[21,12,21,16],[21,17,21,24],[10,2,10,11],[10,12,10,15],[10,16,10,25],[11,0,11,1],[11,3,11,5],[11,6,11,7],[11,8,11,9],[11,10,11,25],[12,1,12,9],[12,10,12,24],[13,0,13,25],[19,0,19,25],[20,1,20,24],[8,22,8,23],[8,24,8,25],[9,0,9,10],[9,12,9,13],[9,18,9,20],[9,22,9,25],[8,0,8,3],[8,4,8,8],[8,9,8,13],[8,14,8,16],[8,17,8,19],[8,20,8,21],[6,18,6,21],[6,23,6,25],[7,0,7,2],[7,3,7,8],[7,9,7,14],[7,15,7,20],[7,21,7,22],[7,23,7,25],[6,0,6,1],[6,2,6,4],[6,5,6,7],[6,8,6,11],[6,12,6,17],[4,2,4,11],[4,12,4,15],[4,16,4,25],[5,0,5,1],[5,3,5,5],[5,6,5,7],[5,8,5,9],[5,10,5,11],[5,12,5,15],[5,16,5,19],[5,20,5,21],[1,0,1,7],[1,8,1,25],[2,0,2,1],[2,2,2,25],[3,0,3,12],[3,14,3,15],[3,20,3,22],[3,24,3,25]]}
[]
[null,null,null,null,null,null,null,null,"SEGURO DE VIDA MULTIRIESGO PERSONAL\nPAGO DE DEUDAS A LOS ACREEDORES DEL ASEGURADO POR MUERTE, INCAPACIDAD TOTAL Y PERMANENTE Y ENFERMEDADES CATASTRÓFICAS\n\nSOLICITUD - CERTIFICADO "]
["Poliza: Nª 5754"]
["DATOS DEL ASEGURADO TITULAR PRINCIPAL-DEUDOR",null,null,null,null,null,null,null,null,null,null,null,null,"CI",null,null,"Pasaporte ",null,null,null,null,null,null,"Nº",{"$f":"+FORM!F40","v":"XXXXXXXXXX"}]
["Apellidos:",null,{"$f":"CONCATENATE(COTIZADOR!F18,\" \",COTIZADOR!L18)","v":"PRIMER APELLIDO SEGUNDO APELLIDO"},null,null,null,null,null,null,null,null,null,"Nombres:   ",null,null,null,{"$f":"CONCATENATE(COTIZADOR!F20,\" \",COTIZADOR!L20)","v":"PRIMER NOMBRE SEGUNDO NOMBRE"}]
["Día nacimiento: ",null,null,"Mes:      ",null,null,null,null,"Año:",null,null,null,"Estado civil:",null,null,null,null,null,null,null,"Género:   ",null,"F","M","Ocupación:",{"$f":"+FORM!F58","v":"INGENIERO"}]
["Celular 1:",null,{"$f":"+FORM!F38","v":"CELULAR"},null,null,"Celular 2:",null,null,null,null,null,null,"Teléfono Particular:",null,null,null,null,null,null,null,null,null,"Mail: ",{"$f":"+FORM!F50","v":"Correo"}]
["Dirección del domicilio:",null,null,null,null,null,null,null,null,"Calle Principal Nº:",null,null,null,null,null,null,null,null,null,null,null,"Transversal:"]
[" Nº casa/ Departamento:",null,null,null,null,null,null,null,null,"Barrio/ Sector:",null,null,null,null,null,null,null,"Ciudad:",null,null,null,null,"Provincia:"]
["DATOS DEL TARJETA HABIENTE ADICIONAL",null,null,null,null,null,null,null,null,null,null,"CI",null,null,"Pasaporte ",null,null,null,null,null,null,"Nº"]
["Apellidos:",null,null,null,null,null,null,null,null,null,null,null,"Nombres:   "]
["Día nacimiento: ",null,null,"Mes:      ",null,null,null,null,"Año:"]
["Yo,",{"$f":"CONCATENATE(Q5,C5)","v":"PRIMER NOMBRE SEGUNDO NOMBREPRIMER APELLIDO SEGUNDO APELLIDO"},null,null,null,null,null,null,null,null,"identificado(a) con la cédula de identidad   o pasaporte   número:",null,null,null,null,null,null,null,null,null,null,null,null,null,null,{"$f":"+FORM!F40","v":"XXXXXXXXXX"}]
["Autorizo a Seguros del Pichincha debitar mensualmente de mi tarjeta de Crédito la prima correspondiente al producto Desgravamen Saldos:"]
[null,"Diners","No.",null,{"$f":"LEFT(FORM!F151,2)","v":"36"},null,"x","x","x","x","x","x","x","x",{"$f":"RIGHT(FORM!L151,4)","v":"7890"}]
[]
[null,"Discover","No.",null,null,null,"x","x","x","x","x","x","x","x","x","x"]
[]
[null,"Visa Titanium","No.",null,null,null,"x","x","x","x","x","x","x","x","x","x"]
["Cualquier instrucción para que se deje sin efecto esta autorización la presentaré a Seguros del Pichincha, con treinta (30) días de antelación al siguiente cobro y con copia al Asegurado establecido más adelante, adjuntando a dicha petición el recibido de la misma por parte del Asegurado. En caso que sea titular en más de una tarjeta, autorizo a que el valor total de la prima se cobre proporcionalmente al saldo de cada tarjeta."]
[null,"TABLA DE COBERTURAS"]
[null,"COBERTURAS",null,null,null,null,null,null,null,null,null,null,"ASEGURADO",null,null,null,null,"VALOR ASEGURADO"]
[null,"Muerte por cualquier causa No excluida",null,null,null,null,null,null,null,null,null,null,"Tarjeta habiente",null,null,null,null,"Saldo insoluto de la deuda, máximo $60.000"]
[null,"Incapacidad total y permanente – (Enfermedades Catastróficas)",null,null,null,null,null,null,null,null,null,null,"Tarjeta habiente ",null,null,null,null,"Saldo insoluto de la deuda, máximo $60.000"]
["CONDICIONES DEL SEGURO"]
["OBJETO DEL SEGURO:\nProteger el saldo insoluto de la tarjeta habiente ante la entidad financiera cubriendo el riesgo que no pueda ser reembolsado a consecuencia de muerte por cualquier causa o incapacidad total y permanente o enfermedades catastróficas de la tarjeta habiente y/o sus adicionales en caso que los tuviera."]
["COBERTURAS:\nMUERTE POR CUALQUIER CAUSA: \nPor la muerte del Asegurado, originada por cualquier causa, a excepción del suicidio voluntario o involuntario del Asegurado el cual se cubrirá transcurrido el primer año de vigencia del contrato, la Compañía pagará a la persona jurídica que tenga la calidad de beneficiario acreedor el saldo adeudado que el Asegurado mantenga con la tarjeta de crédito emitida por Banco Diners Club S.A. (Diners, Discover, Visa Titanium)."]
["INCAPACIDAD TOTAL Y PERMANENTE – ENFERMEDADES CATASTRÓFICAS\nPor la Incapacidad Total y Permanente por cualquier causa no excluida, sufrida por el Asegurado durante la vigencia de este seguro, la Compañía pagará a la persona jurídica que tenga la calidad de beneficiario acreedor el saldo adeudado que el Asegurado mantenga con la tarjeta de crédito emitida por Banco Diners Club S.A. (Diners, Visa Titanium, Discover).\nPara efectos de este seguro se entiende que se presenta incapacidad total y permanente, cuando el Asegurado de acuerdo a lo estipulado en el literal de límites de edad, sufra alteraciones funcionales, comprobables desde el punto de vista médico, que de por vida le impidan desempeñar cualquier actividad, ocupación o trabajo remunerativo o lucrativo para los cuales se encuentra razonablemente calificado en razón de su educación, entrenamiento o experiencia, siempre que dicha incapacidad haya existido por un período continuo no menor a ciento ochenta (180) días y no haya sido provocada por el Asegurado y sea superior al 50% calificada por la entidad de control."]
["Enfermedades catastróficas:\nCon el diagnóstico médico que evidencie que el Asegurado sufre por primera ocasión durante la vigencia de la póliza, cualquiera de las siguientes enfermedades descritas a continuación y una vez certificado por la Institución médica autorizada y reconocida legalmente para ese fin, la Compañía pagará al beneficiario acreedor el saldo adeudado que el Asegurado mantenga con la tarjeta de crédito emitida por Banco Diners Club S.A. (Diners, Discover, Visa Titanium). \nPara efectos de esta cobertura se definen las enfermedades catastróficas o de alta complejidad así: \n• Todo tipo de malformaciones congénitas de corazón y todo tipo de valvulopatías cardiacas, Todo tipo de cáncer, Tumor cerebral en cualquier estado y de cualquier tipo, Insuficiencia renal crónica, Tumores en la piel; cáncer in situ no invasivo en cualquier órgano, Tumores cerebrales superficiales benignos, Acontecimientos catastróficos originados por reacciones nucleares, Quemaduras de primer y segundo grado, Trasplante de órganos (riñón, hígado, médula ósea.), Secuelas de quemaduras graves, Malformaciones arterio venosas cerebrales, Síndrome de Klippel Trenaunay, Aneurisma tóraco-abdominaI. \nEXCLUSIONES DE INCAPACIDAD TOTAL Y PERMANENTE: \nPara la cobertura de Incapacidad Total y Permanente aplican las siguientes exclusiones:\n• Cualquier enfermedad o accidente preexistente a la contratación del seguro.\n• Suicidio, tentativa de suicidio, o lesión intencionalmente causada a sí mismo, ya sea en estado de cordura o demencia \n• Guerra civil o internacional, motín, huelga, movimientos subversivos o en general conmociones civiles de cualquier clase.\n• Acontecimientos catastróficos originados por reacciones nucleares\nPara la cobertura de enfermedades catastróficas aplican las siguientes exclusiones: \n• Cualquier enfermedad preexistente a la contratación del seguro. \nDEFINICIONES:\nASEGURADO PRINCIPAL. - El titular de la tarjeta de crédito otorgado por la entidad financiera y sus tarjetahabientes adicionales.\nBENEFICIARIO ACREEDOR.- La entidad financiera, con la cual el asegurado ha generado una obligación económica, en este caso hasta el saldo insoluto de la deuda.\nSALDO INSOLUTO.- La sumatoria de capital más intereses corrientes."]
["PAGO DE PRIMAS: \nEl presente seguro se mantendrá vigente siempre y cuando exista el pago respectivo y mientras tenga una deuda con la entidad financiera.  En caso de presentarse un siniestro que afecte a la cobertura de muerte por cualquier causa de este certificado, el pago de primas se dará por terminado.\nVIGENCIA:\nEsta póliza adquiere fuerza legal desde el día y hora indicados en este certificado como comienzo de su vigencia y permanecerá en vigor por el período que se mantenga la deuda."]
[]
["AVISO Y COMPROBACION DEL SINIESTRO:\nCorresponde al Asegurado o al (o los) beneficiario (s) instituido (s):"]
["a) Denunciar la muerte, accidente, incapacidad, lesión corporal o enfermedad cubiertos por esta póliza dentro de los quince (15) días de la fecha en que haya ocurrido, salvo caso fortuito, fuerza mayor o imposibilidad de hecho, sin culpa o negligencia, so pena de perder todo derecho a la indemnización, de acuerdo con el artículo 24 de la sección 4ª del capítulo I, del Título XVII del Código de Comercio Ecuatoriano.\nb) Suministrar pruebas sobre la fecha y las causas del reclamo, como acerca de la manera y el lugar en que se produjo el hecho.\nc) Presentar a la Compañía el diagnóstico de la enfermedad, confirmado mediante evidencias médicas, exámenes de laboratorio clínico, químico o patológico efectuados por un profesional médico o médico legista (para muerte accidental), autorizado legalmente para el ejercicio de su profesión.\nd) Facilitar cualquier comprobación o aclaración, incluso hasta dos exámenes médicos por facultativos designados por la Compañía con gastos a cargo de ésta.\ne) Adoptar todas las medidas posibles conducentes a disminuir las consecuencias del  accidente, enfermedad o lesión.\nLa Compañía, en caso de muerte del Asegurado, se reserva el derecho de gestionar la exhumación del cadáver y practicar la autopsia en presencia de uno de sus facultativos, con gastos a cargo de la misma. El beneficiario prestará su conformidad y su concurso para la obtención de las correspondientes autorizaciones para realizarla."]
["DOCUMENTACION MÍNIMA EN CASO DE SINIESTRO:\nDentro del término legal, la Compañía pagará por conducto del Contratante al Asegurado o a los beneficiarios, o directamente a estos, la indemnización a que está obligada por esta póliza y sus amparos adicionales si los hubiere, al acreditar la ocurrencia del siniestro y la cuantía del mismo; para el efecto podrá utilizar todos los medios probatorios admitidos en la Ley ecuatoriana, y en especial la documentación mínima relacionada en el cuadro de documentos mínimos requeridos en caso de siniestro.\nPara que la Compañía pague la indemnización correspondiente a los diferentes amparos, el Asegurado y/o los Beneficiarios deberán presentar pruebas fehacientes que determinen la existencia del hecho amparado, de acuerdo con los términos de esta póliza.\nLa Compañía se reserva el derecho de comprobar la veracidad y la exactitud de tales pruebas.\nLa Compañía podrá hacer examinar al Asegurado tantas veces como lo estime conveniente, mientras se encuentre pendiente un reclamo bajo el presente amparo."]
["PLAZO DE PRUEBA:\nLa Compañía dentro de los treinta (30) días calendario de recibido el aviso y/o la respectiva prueba de la ocurrencia del siniestro y su cuantía, contados desde la fecha que sea posterior, deberá hacer saber al Asegurado la aceptación, postergación o rechazo del otorgamiento del beneficio. Si las comprobaciones a que se refiere el artículo vigésimo segundo no resultaran concluyentes, la Compañía podrá ampliar el plazo de prueba por un término no mayor de tres (3) meses, a fin de confirmar el diagnóstico."]
["DUPLICADO DE POLIZA Y DE CERTIFICADOS – COPIAS:\nEn caso de robo, pérdida o destrucción de esta póliza o de cualquier certificado individual, el Asegurado,  podrá obtener su sustitución por un duplicado. Las modificaciones o suplementos que se incluyan en el duplicado,  del Asegurado, serán los únicos válidos.\nEl  Asegurado tiene derecho a que se le entregue copia de su declaración efectuada con motivo de este contrato y copia no negociable de esta póliza o del correspondiente certificado individual.\nSerán por cuenta de los solicitantes los gastos que origine la extensión de duplicados y copias"]
["TERMINACION  DEL SEGURO INDIVIDUAL:\nEl seguro de cada Asegurado terminará en los siguientes casos:"]
["a) Por cancelación por parte del Asegurado;\nb) Por vencimiento de la vigencia de esta póliza o por caducidad del efecto vinculante;\nc) Por cumplir el Asegurado la edad señalada en la tabla de edades máximas;\nd) Por falta de pago de la prima o su contribución."]
["La cancelación a que se refiere el punto a) deberá ser comunicada por escrito a la Compañía por intermedio del Contratante o por el propio Asegurado con cinco (5) días hábiles de antelación a la fecha en que se deba hacer el pago de prima correspondiente y tendrá efecto a partir de esa fecha de pago. En caso de que el aviso de cancelación no se reciba en el período establecido, la cancelación se hará efectiva a partir de la siguiente fecha de pago.\nEn los casos previstos en los puntos b) y c) el seguro quedará rescindido a las veinticuatro (24) horas en que se haya producido la renuncia, o rescisión o caducidad, o el Asegurado haya cumplido la edad señalada en la tabla de edades máximas.\nSe presumirá que un Asegurado ha cancelado el seguro, sin admitirse prueba en contrario, cuando no pague la prima de este seguro o su contribución en la forma y plazo previsto en estas condiciones generales.\nEn cualquier caso de vencimiento o caducidad de esta póliza, terminarán simultáneamente todos los seguros individuales cubiertos por ella salvo las obligaciones pendientes a cargo de la Compañía."]
["DECLARACIONES Y AUTORIZACIONES DEL ASEGURADO PRINCIPAL:\nA. En el evento en que SEGUROS DEL PICHINCHA S.A. COMPAÑÍA DE SEGUROSY REASEGUROS otorgue el seguro de desgravamen, de acuerdo con la información suministrada en este tipo de seguro, la cobertura amparará a la persona que firma esta declaración.\nB. Acepto el valor de la prima del presente seguro sea cargado en el estado de cuenta de mi tarjeta. El valor de la prima se realizará en base al cálculo del 0.099% sobre mi deuda con Banco Diners Club del Ecuador."]
["C. DECLARACIÓN DE INFORMACIÓN\nDeclaro que la información contenida en el presente formulario es verdadera, completa y actualizada. Declaro conocer y aceptar que es mi obligación actualizar anualmente mis datos personales, comunicar y documentar de manera inmediata a SEGUROS DEL PICHINCHA S.A. COMPAÑÍA DE SEGUROSY REASEGUROS cualquier cambio en la información o documentación que he proporcionado. Durante la vigencia de la relación contractual con SEGUROS DEL PICHINCHA S.A. COMPAÑÍA DE SEGUROS Y REASEGUROS, me comprometo "]
["a proveer la información y la documentación que me sea solicitada. Así mismo entiendo que esta información podrá ser requerida por las autoridades de control respectivas para los efectos legales correspondientes.\nD. DECLARACIÓN DE LICITUD DE FONDOS\nDeclaro que el dinero utilizado para realizar las transacciones con SEGUROS DEL PICHINCHA S.A. COMPAÑÍA DE SEGUROS Y REASEGUROS no proviene de ninguna actividad relacionada con el lavado de activos, el financiamiento del terrorismo, el financiamiento de otros delitos, ni es producto de algún delito. Así mismo declaro que realizo y realizaré operaciones lícitas con SEGUROS DEL PICHINCHA S.A. COMPAÑÍA DE SEGUROS Y REASEGUROS desde el inicio de la relación comercial hasta la finalización del contrato.\nE. AUTORIZACION\nAdemás, autorizo a SEGUROS DEL PICHINCHA S.A. COMPAÑÍA DE SEGUROS Y REASEGUROS a utilizar mi información personal proporcionada a la aseguradora o cualquier  información que sea de conocimiento público conforme a la ley,  con el objetivo de   contactarme, por medio de  llamada telefónica, mensaje de texto vía telefónica, correo electrónico, correo directo u otro medio.\nF. DECLARO HABER RECIBIDO LAS EXPLICACIONES CORRESPONDIENTES SOBRE ESTE SEGURO Y ACEPTO DE MANERA VOLUNTARIA EL MISMO."]
["El Contratante y/o Asegurado podrá solicitar a la Superintendencia de Compañías, Valores y Seguros la verificación de este texto."]
[]
[]
[]
[]
["Seguros del Pichincha  S.A",null,null,null,null,null,null,null,null,null,null,null,null,null,null,null,"Asegurado Principal"]
[]
["IMPORTANTE: \nLea cuidadosamente el extracto de las condiciones generales entregado; si tuviese alguna inquietud comuníquese al 1800-400-400 de SEGUROS DEL PICHINCHA."]